Project Number Date
test_Tails_ISO_stable 4685 28 Feb 2024, 12:18

Tag Report

Steps Scenarios Features
Tag Passed Failed Skipped Pending Undefined Total Passed Failed Total Duration Status
@product 1389 3 32 0 0 1424 189 3 192 4:5:32.563 Failed
Tags: @product
1:38.883
Before features/support/hooks.rb:245 0.042
Given a computer 0.660
And I temporarily create a 100 MiB disk named "swap" 0.289
And I create a gpt swap partition on disk "swap" 9.733
And I plug SATA drive "swap" 1.044
And I temporarily create a 2 GiB disk named "live_hd" 0.099
And I write the Tails ISO image to disk "live_hd" 17.356
And I plug SATA drive "live_hd" 1.050
When I start Tails with network unplugged and I login 1:8.278
Then a "swap" partition was detected by Tails on drive "swap" 0.100
And drive "live_hd" is detected by Tails 0.122
But Tails has no disk swap enabled 0.084
And drive "live_hd" is not mounted 0.063
After features/support/hooks.rb:291 0.632
After features/support/hooks.rb:75 0.111
Tags: @product
1:19.563
Before features/support/hooks.rb:245 0.002
Given a computer 0.125
And I temporarily create a 100 MiB disk named "fake_TailsData" 0.030
And I create a gpt partition labeled "TailsData" with an ext4 filesystem encrypted with password "asdf" on disk "fake_TailsData" 15.247
And I plug non-removable USB drive "fake_TailsData" 1.039
When I start the computer 0.978
And the computer boots Tails 49.041
Then drive "fake_TailsData" is detected by Tails 0.140
And Tails Greeter has not detected a persistence partition 12.959
After features/support/hooks.rb:291 0.696
After features/support/hooks.rb:75 0.007
Tags: @product
1:27.542
Before features/support/hooks.rb:245 0.002
Given a computer 0.124
And I temporarily create a 100 MiB disk named "fake_TailsData" 0.028
And I create a gpt partition labeled "TailsData" with an ext4 filesystem encrypted with password "asdf" on disk "fake_TailsData" 22.780
And I plug SATA drive "fake_TailsData" 1.042
When I start the computer 0.968
And the computer boots Tails 49.241
Then drive "fake_TailsData" is detected by Tails 0.247
And Tails Greeter has not detected a persistence partition 13.108
After features/support/hooks.rb:291 0.722
After features/support/hooks.rb:75 0.007
Tags: @product
1:22.479
Before features/support/hooks.rb:245 0.002
Given a computer 0.123
And I temporarily create a 100 MiB disk named "gpt_ext2" 0.028
And I create a gpt partition with an ext2 filesystem on disk "gpt_ext2" 4.382
And I plug SATA drive "gpt_ext2" 1.333
And I temporarily create a 100 MiB disk named "msdos_fat32" 0.173
And I create an msdos partition with a vfat filesystem on disk "msdos_fat32" 4.471
And I plug SATA drive "msdos_fat32" 1.065
And I start Tails from DVD with network unplugged and I login 1:10.545
Then drive "gpt_ext2" is detected by Tails 0.135
And drive "gpt_ext2" is not mounted 0.067
And drive "msdos_fat32" is detected by Tails 0.088
And drive "msdos_fat32" is not mounted 0.063
After features/support/hooks.rb:291 1.388
After features/support/hooks.rb:75 0.011
Tags: @product
1:56.114
Before features/support/hooks.rb:245 0.002
Given I have started Tails from DVD without network and logged in with an administration password 1:40.769
And running a command as root with pkexec requires PolicyKit administrator privileges 0.135
Then I can run a command as root with sudo 0.099
Then I can run a command as root with pkexec 15.109
After features/support/hooks.rb:291 0.774
After features/support/hooks.rb:75 0.005
Tags: @product
1:57.686
Before features/support/hooks.rb:245 0.001
Given I have started Tails from DVD without network and logged in 36.801
And running a command as root with pkexec requires PolicyKit administrator privileges 0.115
Then I cannot run a command as root with sudo and the standard passwords 0.177
And I cannot run a command as root with pkexec and the standard passwords 28.208
Then I cannot login as root using su with the standard passwords 52.383
After features/support/hooks.rb:291 0.689
After features/support/hooks.rb:75 0.000
Feature: Time syncing
22.886
Before features/support/hooks.rb:245 0.002
Before features/support/hooks.rb:442 0.012
Given I have started Tails from DVD without network and logged in 7.964
When the network is plugged 0.151
And I successfully configure Tor 14.721
Then the system clock is less than 5 minutes incorrect 0.048
After features/support/hooks.rb:450 0.557
After features/support/hooks.rb:291 0.604
After features/support/hooks.rb:75 0.000
Feature: Time syncing
24.389
Before features/support/hooks.rb:245 0.002
Before features/support/hooks.rb:442 0.002
Given I have started Tails from DVD without network and logged in 7.934
When the network is plugged 0.028
And the Tor Connection Assistant autostarts 2.334
And I configure some normal bridges in the Tor Connection Assistant 12.506
And I wait until Tor is ready 1.520
Then the system clock is less than 5 minutes incorrect 0.065
After features/support/hooks.rb:450 0.388
After features/support/hooks.rb:291 0.709
After features/support/hooks.rb:75 0.000
Feature: Time syncing
26.680
Before features/support/hooks.rb:245 0.002
Before features/support/hooks.rb:442 0.002
Given I have started Tails from DVD without network and logged in 7.964
When I bump the system time with "+1 day" 0.262
And I capture all network traffic 0.002
And the network is plugged 0.038
And the Tor Connection Assistant autostarts 3.068
And I configure some obfs4 bridges in the Tor Connection Assistant in easy mode 11.324
And I wait until Tor is ready 3.036
Then the system clock is less than 5 minutes incorrect 0.055
And all Internet traffic has only flowed through the configured bridges or connectivity check service 0.927
After features/support/hooks.rb:450 0.486
After features/support/hooks.rb:291 0.549
After features/support/hooks.rb:75 0.043
Feature: Time syncing
1:16.080
Before features/support/hooks.rb:245 0.002
Before features/support/hooks.rb:442 0.006
Given I have started Tails from DVD without network and logged in 7.935
When I bump the system time with "-15 days" 0.170
And I warm reboot the computer 0.014
And the computer reboots Tails 1:7.019
Then Tails' hardware clock is close to the host system's time 0.940
After features/support/hooks.rb:450 0.101
After features/support/hooks.rb:291 0.601
After features/support/hooks.rb:75 0.005
Feature: Time syncing
1:10.273
Before features/support/hooks.rb:245 0.002
Before features/support/hooks.rb:442 0.002
Given I have started Tails from DVD without network and logged in 7.871
When I bump the hardware clock's time with "-15 days" 1.414
And I warm reboot the computer 0.013
And the computer reboots Tails 1:0.743
Then the hardware clock is still off by "-15 days" 0.231
After features/support/hooks.rb:450 0.111
After features/support/hooks.rb:291 0.844
After features/support/hooks.rb:75 0.005
Feature: Time syncing
51.902
Before features/support/hooks.rb:245 0.002
Before features/support/hooks.rb:442 0.002
Given a computer 0.879
And the hardware clock is set to "01 Jan 2000 12:34:56" 0.091
And I start the computer 1.022
And the computer boots Tails 49.695
Then the system clock is just past Tails' source date 0.213
After features/support/hooks.rb:450 0.127
After features/support/hooks.rb:291 0.567
After features/support/hooks.rb:75 0.006
Feature: Time syncing
30.035
Before features/support/hooks.rb:245 0.002
Before features/support/hooks.rb:442 0.002
Given I have started Tails from DVD without network and logged in 7.877
And I make sure time sync before Tor connects times out 1.124
When the network is plugged 0.057
And I successfully configure Tor 20.906
Then the system clock is less than 5 minutes incorrect 0.068
After features/support/hooks.rb:450 0.547
After features/support/hooks.rb:291 0.617
After features/support/hooks.rb:75 0.001
Feature: Time syncing
58.369
Before features/support/hooks.rb:245 0.002
Before features/support/hooks.rb:442 0.002
Given I have started Tails from DVD without network and logged in 7.833
When I bump the system time with "+8 hours +15 minutes" 0.180
And all notifications have disappeared 2.654
And I capture all network traffic 0.002
And I make sure time sync before Tor connects fails 0.091
And the network is plugged 0.024
And the Tor Connection Assistant autostarts 2.897
When I configure the default bridges in the Tor Connection Assistant in easy mode without connecting 4.931
And I click "Connect to Tor" 1.138
And the Tor Connection Assistant fails to connect to Tor 15.167
# The "Fix Clock" button allows users to recover from this bug
Then I set the time zone in Tor Connection to "Asia/Shanghai" 14.868
Then the system clock is less than 20 minutes incorrect 0.170
When I click "Connect to Tor" 1.134
Then I wait until Tor is ready 6.257
And all Internet traffic has only flowed through the default bridges or fake connectivity check service 0.964
# check that htpdate has done its job
And the system clock is less than 5 minutes incorrect 0.052
After features/support/hooks.rb:450 0.501
After features/support/hooks.rb:291 0.641
After features/support/hooks.rb:75 0.060
Feature: Time syncing
53.937
Before features/support/hooks.rb:245 0.002
Before features/support/hooks.rb:442 0.002
Given I have started Tails from DVD without network and logged in 7.825
When I bump the system time with "+8 hours +15 minutes" 0.173
And all notifications have disappeared 2.645
And I capture all network traffic 0.003
And the network is plugged 0.032
And the Tor Connection Assistant autostarts 2.806
# Anti-test: Users east of UTC can't connect to obfs4 bridges
And I configure some obfs4 bridges in the Tor Connection Assistant in hide mode without connecting 4.025
And I click "Connect to Tor" 1.152
Then the Tor Connection Assistant reports that it failed to connect 11.675
# The "Fix Clock" button allows users to recover from this bug
When I set the time zone in Tor Connection to "Asia/Shanghai" 14.678
Then the system clock is less than 20 minutes incorrect 0.186
# "Asia/Shanghai" is UTC+08:00 all year long (no DST)
And the displayed clock is less than 20 minutes incorrect in "+08:00" 0.324
When I click "Connect to Tor" 1.147
Then I wait until Tor is ready 5.861
And all Internet traffic has only flowed through the configured bridges 0.987
# check that htpdate has done its job
And the system clock is less than 5 minutes incorrect 0.055
And the displayed clock is less than 5 minutes incorrect in "+08:00" 0.355
After features/support/hooks.rb:450 0.531
After features/support/hooks.rb:291 0.709
After features/support/hooks.rb:75 0.033
Feature: Time syncing
21.176
Before features/support/hooks.rb:245 0.002
Before features/support/hooks.rb:442 0.002
Given I have started Tails from DVD without network and logged in 7.967
And I make sure time sync before Tor connects uses a fake connectivity check service 1.128
And the network is plugged 0.039
And Tor is ready 10.563
Then the fake connectivity check service has received a new HTTP request 0.000
When I make NetworkManager perform a connectivity check 1.473
Then the fake connectivity check service has received a new HTTP request 0.000
And the HTTP requests received by the fake connectivity check service are identical 0.003
After features/support/hooks.rb:450 0.551
After features/support/hooks.rb:291 0.759
After features/support/hooks.rb:75 0.000
Tags: @product
15.386
When I configure some normal bridges in the Tor Connection Assistant 11.898
Then I wait until Tor is ready 1.537
And tca.conf includes the configured bridges 0.011
And available upgrades have been checked 1.106
And all Internet traffic has only flowed through the configured bridges or connectivity check service 0.832
After features/support/hooks.rb:291 0.606
After features/support/hooks.rb:75 0.040
Tags: @product
14.961
When I configure some obfs4 bridges in the Tor Connection Assistant in hide mode 11.275
Then I wait until Tor is ready 2.682
And tca.conf includes the configured bridges 0.013
And available upgrades have been checked 0.070
And all Internet traffic has only flowed through the configured bridges 0.920
After features/support/hooks.rb:291 0.653
After features/support/hooks.rb:75 0.037
Tags: @product
35.007
When I configure some obfs4 bridges from a QR code in the Tor Connection Assistant in hide mode 31.526
Then I wait until Tor is ready 2.563
And tca.conf includes the configured bridges 0.012
And available upgrades have been checked 0.051
And all Internet traffic has only flowed through the configured bridges 0.853
After features/support/hooks.rb:291 0.593
After features/support/hooks.rb:75 0.070
Tags: @product
1:4.552
Given the Tor network and default bridges are blocked 1.778
When I unsuccessfully configure a direct connection in the Tor Connection Assistant 29.905
Then the Tor Connection Assistant reports that it failed to connect 0.095
And tca.conf is empty 0.204
Given I scan a QR code from the error page in Tor Connection Assistant 20.463
And I retry connecting to Tor 1.135
Then I wait until Tor is ready 9.997
And tca.conf includes the configured bridges 0.011
And available upgrades have been checked 0.060
And all Internet traffic has only flowed through the configured bridges or connectivity check service 0.901
After features/support/hooks.rb:291 0.731
After features/support/hooks.rb:75 0.041
16.281
When I configure the default bridges in the Tor Connection Assistant 10.692
Then I wait until Tor is ready 3.688
And Tor is configured to use the default bridges 0.453
And tca.conf includes no bridge 0.011
And available upgrades have been checked 0.048
And Tor is configured to use the default bridges 0.426
And all Internet traffic has only flowed through the default bridges or connectivity check service 0.959
After features/support/hooks.rb:291 0.622
After features/support/hooks.rb:75 0.043
Tags: @product
26.529
Given the Tor network is blocked 1.772
When I configure a direct connection in the Tor Connection Assistant 20.454
Then I wait until Tor is ready 2.780
And tca.conf includes no bridge 0.012
And available upgrades have been checked 0.042
And Tor is configured to use the default bridges 0.498
And all Internet traffic has only flowed through the default bridges or connectivity check service 0.968
After features/support/hooks.rb:291 0.616
After features/support/hooks.rb:75 0.049
Tags: @product
43.123
Given the Tor network and default bridges are blocked 1.730
When I unsuccessfully configure a direct connection in the Tor Connection Assistant 29.770
Then the Tor Connection Assistant reports that it failed to connect 0.132
And tca.conf is empty 0.183
Given the Tor network and default bridges are unblocked 1.218
And I retry connecting to Tor 1.146
Then I wait until Tor is ready 6.925
And tca.conf includes no bridge 0.014
And available upgrades have been checked 1.121
And all Internet traffic has only flowed through Tor or connectivity check service 0.879
After features/support/hooks.rb:291 1.185
After features/support/hooks.rb:75 0.052
Tags: @product
4.563
When I try to configure some normal bridges in the Tor Connection Assistant in hide mode 4.289
Then the Tor Connection Assistant complains that normal bridges are not allowed 0.128
And I cannot click the "Connect to Tor" button 0.145
After features/support/hooks.rb:291 0.642
After features/support/hooks.rb:75 0.040
Tags: @product
23.707
Given I configure a direct connection in the Tor Connection Assistant 6.738
And I wait until Tor is ready 2.348
When I disconnect the network through GNOME 2.539
And I connect the network through GNOME 2.768
Then the Tor Connection Assistant autostarts 1.752
And the Tor Connection Assistant connects to Tor 4.752
And I wait until Tor is ready 0.965
And Tor is using the same configuration as before 0.000
And available upgrades have been checked 0.052
And all Internet traffic has only flowed through Tor or connectivity check service 1.789
After features/support/hooks.rb:291 0.593
After features/support/hooks.rb:75 0.052
Tags: @product
41.900
Given I configure a direct connection in the Tor Connection Assistant 5.928
And I wait until Tor is ready 3.641
And I disconnect the network through GNOME 2.673
And the Tor network and default bridges are blocked 1.403
When I connect the network through GNOME 2.788
Then the Tor Connection Assistant reports that it failed to connect 25.465
After features/support/hooks.rb:291 0.732
After features/support/hooks.rb:75 0.059
Tags: @product
34.884
Given the Tor network and default bridges are blocked 1.638
When I unsuccessfully configure some default bridges in the Tor Connection Assistant 21.597
Then the Tor Connection Assistant reports that it failed to connect 0.116
Given the Tor network and default bridges are unblocked 1.460
When I click "Connect to Tor" 1.150
Then I wait until Tor is ready 7.272
And Tor is configured to use the default bridges 0.598
And all Internet traffic has only flowed through the default bridges or connectivity check service 1.050
After features/support/hooks.rb:291 1.105
After features/support/hooks.rb:75 0.033
19.086
Before features/support/hooks.rb:245 0.002
Given I have started Tails from DVD without network and logged in 7.956
And I prepare Tails for memory erasure tests 0.396
When I start a process allocating 128 MiB of memory with a known pattern 1.214
Then patterns cover at least 128 MiB in the guest's memory 4.660

Pattern coverage: 100.000% (128 MiB out of 128 MiB reference memory)

When I kill the allocating process 0.711
Then I find very few patterns in the guest's memory 4.147

Pattern coverage: 0.000% (0 MiB out of 939 MiB reference memory)

After features/support/hooks.rb:291 0.716
After features/support/hooks.rb:75 0.000
22.240
Before features/support/hooks.rb:245 0.002
Given I have started Tails from DVD without network and logged in 8.186
And I prepare Tails for memory erasure tests 0.427
And I find very few patterns in the guest's memory 3.914

Pattern coverage: 0.000% (0 MiB out of 936 MiB reference memory)

When I mount a 128 MiB tmpfs on "/mnt" and fill it with a known pattern 1.464
Then patterns cover at least 99% of the test FS size in the guest's memory 3.738

Pattern coverage: 100.000% (128 MiB out of 128 MiB reference memory)

When I umount "/mnt" 0.335
Then I find very few patterns in the guest's memory 4.173

Pattern coverage: 0.000% (0 MiB out of 936 MiB reference memory)

After features/support/hooks.rb:291 1.021
After features/support/hooks.rb:75 0.000
47.011
Before features/support/hooks.rb:245 0.002
Given I have started Tails from DVD without network and logged in 8.095
And I prepare Tails for memory erasure tests 0.378
When I plug and mount a 128 MiB USB drive with a vfat filesystem 6.915
Then I find very few patterns in the guest's memory 4.528

Pattern coverage: 0.000% (0 MiB out of 944 MiB reference memory)

# write cache
When I fill the USB drive with a known pattern 2.871
Then patterns cover at least 86% of the test FS size in the guest's memory 3.735

Pattern coverage: 97.698% (124 MiB out of 127 MiB reference memory)

When I umount the USB drive 8.028
Then I find very few patterns in the guest's memory 3.823

Pattern coverage: 0.000% (0 MiB out of 944 MiB reference memory)

# read cache
When I mount the USB drive again 0.204
And I read the content of the test FS 0.629
Then patterns cover at least 99% of the test FS size in the guest's memory 3.239

Pattern coverage: 100.000% (127 MiB out of 127 MiB reference memory)

When I umount the USB drive 0.416
Then I find very few patterns in the guest's memory 4.144

Pattern coverage: 0.000% (0 MiB out of 944 MiB reference memory)

After features/support/hooks.rb:291 0.689
After features/support/hooks.rb:75 0.000
1:2.672
Before features/support/hooks.rb:245 0.002
Given I have started Tails from DVD without network and logged in 8.443
And I prepare Tails for memory erasure tests 0.462
When I plug and mount a 128 MiB USB drive with an ext4 filesystem encrypted with password "asdf" 28.001
Then I find very few patterns in the guest's memory 3.373

Pattern coverage: 0.000% (0 MiB out of 941 MiB reference memory)

# write cache
When I fill the USB drive with a known pattern 3.589
Then patterns cover at least 99% of the test FS size in the guest's memory 3.522

Pattern coverage: 106.113% (97 MiB out of 91 MiB reference memory)

When I umount the USB drive 0.645
Then I find very few patterns in the guest's memory 3.679

Pattern coverage: 0.000% (0 MiB out of 941 MiB reference memory)

# read cache
When I mount the USB drive again 3.729
And I read the content of the test FS 0.453
Then patterns cover at least 99% of the test FS size in the guest's memory 2.846

Pattern coverage: 106.116% (97 MiB out of 91 MiB reference memory)

When I umount the USB drive 0.456
Then I find very few patterns in the guest's memory 3.468

Pattern coverage: 0.000% (0 MiB out of 941 MiB reference memory)

After features/support/hooks.rb:291 0.760
After features/support/hooks.rb:75 0.000
50.451
Before features/support/hooks.rb:245 0.003
Given I have started Tails from DVD without network and logged in 8.025
And I prepare Tails for memory erasure tests 0.370
When I fill a 128 MiB file with a known pattern on the root filesystem 16.565
# ensure the pattern is in memory due to tmpfs, not to disk cache
And I drop all kernel caches 1.099
Then patterns cover at least 128 MiB in the guest's memory 2.568

Pattern coverage: 100.000% (128 MiB out of 128 MiB reference memory)

When I trigger shutdown 0.014
And I wait 20 seconds 20.018

Slept for 20 seconds

Then I find very few patterns in the guest's memory 1.788

Pattern coverage: 0.000% (0 MiB out of 932 MiB reference memory)

After features/support/hooks.rb:291 3.541
After features/support/hooks.rb:75 0.000
8:6.564
Scenario Erasure of read and write disk caches of persistent data on shutdown
Before features/support/hooks.rb:245 0.003
Steps
Given I have started Tails without network from a USB drive with a persistent partition enabled and logged in 8:6.564
cannot find GnomeApplicationsMenu.png on the screen (FindFailed)
./features/support/helpers/screen.rb:166:in `rescue in wait'
./features/support/helpers/screen.rb:159:in `wait'
./features/step_definitions/common_steps.rb:561:in `/^the Tails desktop is ready$/'
./features/step_definitions/common_steps.rb:516:in `/^I log in to a new session(?: in ([^ ]*) \(([^ ]*)\))?( without activating the Persistent Storage)?( after having activated the Persistent Storage| expecting no warning about the Persistent Storage not being activated)?$/'
./features/step_definitions/snapshots.rb:148:in `block in reach_checkpoint'
./features/step_definitions/snapshots.rb:145:in `each'
./features/step_definitions/snapshots.rb:145:in `reach_checkpoint'
./features/step_definitions/snapshots.rb:168:in `/^I\ have\ started\ Tails\ without\ network\ from\ a\ USB\ drive\ with\ a\ persistent\ partition\ enabled\ and\ logged\ in$/'
features/erase_memory.feature:76:in `Given I have started Tails without network from a USB drive with a persistent partition enabled and logged in'
And I prepare Tails for memory erasure tests 0.000
When I fill a 128 MiB file with a known pattern on the persistent filesystem 0.000
When I trigger shutdown 0.000
And I wait 20 seconds 0.000
Then I find very few patterns in the guest's memory 0.000
After features/support/hooks.rb:291 4.655

SCENARIO FAILED: 'Erasure of read and write disk caches of persistent data on shutdown' (at time 00:36:34)

Screenshot: https://jenkins.tails.boum.org/job/test_Tails_ISO_stable/4685/artifact/build-artifacts/00:36:34_Erasure_of_read_and_write_disk_caches_of_persistent_data_on_shutdown.png

Video: https://jenkins.tails.boum.org/job/test_Tails_ISO_stable/4685/artifact/build-artifacts/00:36:34_Erasure_of_read_and_write_disk_caches_of_persistent_data_on_shutdown.mkv

Boot log: https://jenkins.tails.boum.org/job/test_Tails_ISO_stable/4685/artifact/build-artifacts/00:36:34_Erasure_of_read_and_write_disk_caches_of_persistent_data_on_shutdown.boot-log

Systemd journal: https://jenkins.tails.boum.org/job/test_Tails_ISO_stable/4685/artifact/build-artifacts/00:36:34_Erasure_of_read_and_write_disk_caches_of_persistent_data_on_shutdown.journal

After features/support/hooks.rb:75 0.010
34.902
Before features/support/hooks.rb:245 0.002
Given I have started Tails from DVD without network and logged in 8.173
And I temporarily create a 4 GiB disk named "gptfat" 0.049
And I create a gpt partition with a vfat filesystem on disk "gptfat" 5.040
And I plug USB drive "gptfat" 2.502
When I start Tails Installer 19.084
Then I am told by Tails Installer that the destination device "is too small" 0.053
After features/support/hooks.rb:291 0.933
After features/support/hooks.rb:75 0.001
Tags: @product
28.888
Before features/support/hooks.rb:245 0.002
Given I have started Tails from DVD without network and logged in 8.059
And I temporarily create a 7200 MiB disk named "temp" 0.068
And I start Tails Installer 17.811
But a suitable USB device is not found 0.023
When I plug USB drive "temp" 2.654
Then the "temp" USB drive is selected 0.076
When I unplug USB drive "temp" 0.174
Then a suitable USB device is not found 0.021
After features/support/hooks.rb:291 0.687
After features/support/hooks.rb:75 0.000
Tags: @product
3:54.281
Before features/support/hooks.rb:245 0.002
Given I have started Tails from DVD without network and logged in 8.217
And I temporarily create a 7200 MiB disk named "install" 0.105
And I create a gpt partition with a vfat filesystem on disk "install" 4.045
And I plug USB drive "install" 2.570
And I install Tails to USB drive "install" by cloning 3:26.433
Then the running Tails is installed on USB drive "install" 12.844
But there is no persistence partition on USB drive "install" 0.064
After features/support/hooks.rb:291 1.128
After features/support/hooks.rb:75 0.098
Tags: @product
3:50.160
Before features/support/hooks.rb:245 0.002
Given I have started Tails from DVD without network and logged in 8.615
And I temporarily create a 7200 MiB disk named "install" 0.034
And I plug USB drive "install" 2.443
And I install Tails to USB drive "install" by cloning 3:27.679
Then the running Tails is installed on USB drive "install" 11.318
But there is no persistence partition on USB drive "install" 0.068
After features/support/hooks.rb:291 1.451
After features/support/hooks.rb:75 0.126
Tags: @product
9:14.039
Before features/support/hooks.rb:245 0.003
Given I have started Tails without network from a USB drive with a persistent partition enabled and logged in 5:0.981
And I create a file in the Persistent directory 0.082
And I temporarily create a 7200 MiB disk named "install" 0.036
And I create a gpt partition with a vfat filesystem on disk "install" 4.120
And I plug USB drive "install" 2.484
And I install Tails with Persistent Storage to USB drive "install" by cloning 3:50.033
Then the running Tails is installed on USB drive "install" 13.067
And there is a persistence partition on USB drive "install" 0.064
And the USB drive "install" contains the same files as my persistent storage 3.166
After features/support/hooks.rb:291 2.251
After features/support/hooks.rb:75 0.138
Tags: @product
3:56.757
Before features/support/hooks.rb:245 0.004
Given I have started Tails without network from a USB drive with a persistent partition enabled and logged in 12.370
And I temporarily create a 7200 MiB disk named "install" 0.028
And I plug USB drive "install" 2.537
And I install Tails to USB drive "install" by cloning 3:27.614
Then the running Tails is installed on USB drive "install" 14.132
And there is no persistence partition on USB drive "install" 0.074
After features/support/hooks.rb:291 2.731
After features/support/hooks.rb:75 0.099
Tags: @product
4:1.377
Before features/support/hooks.rb:245 0.003
# We reach this first checkpoint only to ensure that the ' __internal' disk has reached the state (Tails installed + persistent partition set up) we need before we clone it below.
# This first part is done without Tails Installer (install from Tails USB image)
# Note: the "__internal" disk will keep its state across scenarios
# and features until one of its snapshots is restored.
Given I have started Tails without network from a USB drive with a persistent partition enabled and logged in 9.787
And I have started Tails from DVD without network and logged in 8.628
And I clone USB drive "__internal" to a temporary USB drive "install" 1.109
And I plug USB drive "install" 2.509
# This second part is done with Tails Installer, that's what this scenario is about
When I reinstall Tails to USB drive "install" by cloning 3:25.562
Then the running Tails is installed on USB drive "install" 13.703
And there is no persistence partition on USB drive "install" 0.077
After features/support/hooks.rb:291 1.104
After features/support/hooks.rb:75 0.096
Tags: @product @uefi
1:37.283
Before features/support/hooks.rb:245 0.003
Given I have started Tails without network from a USB drive without a persistent partition and stopped at Tails Greeter's login screen 10.440
And I power off the computer 0.336
And the computer is set to boot in UEFI mode 0.029
When I start Tails from USB drive "__internal" with network unplugged and I login 1:22.762
Then Tails is running from USB drive "__internal" 0.363
And the boot device has safe access rights 3.303
And Tails has started in UEFI mode 0.046
After features/support/hooks.rb:291 1.587
After features/support/hooks.rb:75 0.006
Tags: @product
1:33.890
Before features/support/hooks.rb:245 0.002
Given I have started Tails from DVD without network and logged in 8.494
And I plug and mount a USB drive containing a Tails USB image 28.114
And I create a 7200 MiB disk named "usbimage" 0.037
And I plug USB drive "usbimage" 2.404
And I install a Tails USB image to the 7200 MiB disk with GNOME Disks 54.839
After features/support/hooks.rb:291 1.735
After features/support/hooks.rb:75 0.107
Tags: @product
1:25.350
Before features/support/hooks.rb:245 0.003
Given a computer 0.128
And I start Tails from USB drive "usbimage" with network unplugged and I login 1:24.185
Then Tails is running from USB drive "usbimage" 0.299
And the label of the system partition on "usbimage" is "Tails" 0.213
And the system partition on "usbimage" is an EFI system partition 0.143
And the FAT filesystem on the system partition on "usbimage" is at least 4000M large 0.128
And the UUID of the FAT filesystem on the system partition on "usbimage" was randomized 0.076
And the label of the FAT filesystem on the system partition on "usbimage" is "TAILS" 0.074
And the system partition on "usbimage" has the expected flags 0.101
After features/support/hooks.rb:291 0.640
After features/support/hooks.rb:75 0.005
4:41.615
Before features/support/hooks.rb:245 0.003
Before features/support/hooks.rb:442 0.003
Given I start Tails from a freshly installed USB drive with an administration password and the network is plugged and I login 50.467
And I update APT using apt 16.558
And I install "popularity-contest" using apt 19.426
Then I am proposed to add the "popularity-contest" package to my Additional Software 6.244
When I create a persistent storage and activate the Additional Software feature 19.136
Then Additional Software is correctly configured for package "popularity-contest" 1.334
When I shutdown Tails and wait for the computer to power off 10.158
And I start Tails from USB drive "__internal" with network unplugged and I login with persistence enabled 2:37.320
Then Additional Software is correctly configured for package "popularity-contest" 0.702
And the package "popularity-contest" is installed after Additional Software has been started 0.265
After features/support/hooks.rb:450 39.214
After features/support/hooks.rb:291 0.943
After features/support/hooks.rb:75 0.015
2:11.649
Before features/support/hooks.rb:245 0.005
Before features/support/hooks.rb:442 0.005
Given a computer 0.184
And I start Tails from USB drive "__internal" and I login with an administration password 1:31.243
And I update APT using apt 15.416
When I install "makepp" using apt 19.279
Then the Additional Software dpkg hook has been run for package "makepp" and notices the persistence is locked 5.435
And the package "makepp" is installed 0.090
After features/support/hooks.rb:450 40.893
After features/support/hooks.rb:291 0.776
After features/support/hooks.rb:75 0.014
4:52.660
Before features/support/hooks.rb:245 0.006
Before features/support/hooks.rb:442 0.006
Given a computer 0.161
And I start Tails from USB drive "__internal" and I login with persistence enabled and an administration password 3:9.994
When I uninstall "popularity-contest" using apt 18.631
And I accept removing "popularity-contest" from Additional Software 0.587
Then "popularity-contest" is not in the list of Additional Software 0.621
When I start Synaptic 22.231
And I update APT using Synaptic 22.098
And I install "cowsay" using Synaptic 11.695
And I accept adding "cowsay" to Additional Software 0.671
Then Additional Software is correctly configured for package "cowsay" 0.773
When I uninstall "cowsay" using apt 3.225
And I refuse removing "cowsay" from Additional Software 0.524
Then Additional Software is correctly configured for package "cowsay" 0.756
When I start "Additional Software" via GNOME Activities Overview 9.776
And I remove "cowsay" from the list of Additional Software using Additional Software GUI 5.606
Then "cowsay" is not in the list of Additional Software 0.904
When I install "cowsay" using apt 3.213
And I refuse adding "cowsay" to Additional Software 0.527
Then "cowsay" is not in the list of Additional Software 0.657
After features/support/hooks.rb:450 0.973
After features/support/hooks.rb:291 0.693
After features/support/hooks.rb:75 0.009
11:51.961
Before features/support/hooks.rb:245 0.006
Before features/support/hooks.rb:442 0.006
Given a computer 0.157
And I start Tails from USB drive "__internal" and I login with persistence enabled and an administration password 2:53.097
And I configure APT to prefer an old version of cowsay 0.023
When I install an old version "3.03+dfsg2-1" of the cowsay package using apt 23.024
And I accept adding "cowsay" to Additional Software 5.689
And Additional Software is correctly configured for package "cowsay" 0.932
And I shutdown Tails and wait for the computer to power off 7.093
And I start Tails from USB drive "__internal" with network unplugged 53.008
And I enable persistence 29.789
# We need to add back this custom APT source for the Additional Software
# install step, as it was not saved in persistence
And I configure APT to prefer an old version of cowsay 0.025
And I log in to a new session 33.548
And the installed version of package "cowsay" is "3.03+dfsg2-1" after Additional Software has been started 31.010
And I revert the APT tweaks that made it prefer an old version of cowsay 0.054
# We remove the newest package after it has been downloaded and before
# it is installed, so that the upgrade process fails
And I prepare the Additional Software upgrade process to fail 0.064
And the network is plugged 0.029
And Tor is ready 18.403
# Note: the next step races against the appearance of the "The
# upgrade of your additional software failed" notification.
# It should win most of the time, which is good, but there's no
# guarantee it does. If it loses, then it'll remove the notification
# we'll be trying to interact with below ("I can open…")
And all notifications have disappeared 6.680
And available upgrades have been checked 0.051
And I see the "The upgrade of your additional software failed" notification after at most 300 seconds 1.160
And I can open the Additional Software configuration window from the notification 2.833
And I shutdown Tails and wait for the computer to power off 2:6.623
And I start Tails from USB drive "__internal" with network unplugged 1:1.058
And I enable persistence 32.015
# We need to add back this custom APT source for the Additional Software
# install step, as it was not saved in persistence
And I configure APT to prefer an old version of cowsay 0.027
And I log in to a new session 33.271
And the installed version of package "cowsay" is "3.03+dfsg2-1" after Additional Software has been started 30.860
And I revert the APT tweaks that made it prefer an old version of cowsay 0.060
And the network is plugged 0.048
And Tor is ready 41.044
Then the Additional Software upgrade service has started 0.177
And the installed version of package "cowsay" is newer than "3.03+dfsg2-1" 0.093
After features/support/hooks.rb:450 2.650
After features/support/hooks.rb:291 1.140
After features/support/hooks.rb:75 0.024
2:17.135
Before features/support/hooks.rb:245 0.004
Before features/support/hooks.rb:442 0.006
Given a computer 0.187
And I start Tails from USB drive "__internal" with network unplugged 53.682
And I enable persistence 30.441
And I remove the "cowsay" deb files from the APT cache 0.658
# Prevent the "Warning: virtual machine detected!" notification from racing
# with the one we'll be interacting with below.
And I disable the tails-virt-notify-user.service user unit 0.082
And I log in to a new session 33.685
Then I see the "The installation of your additional software failed" notification after at most 300 seconds 12.634
And I can open the Additional Software log file from the notification 4.996
And the package "cowsay" is not installed 0.766
After features/support/hooks.rb:450 0.107
After features/support/hooks.rb:291 1.033
After features/support/hooks.rb:75 0.009
Tags: @product
1:53.374
Before features/support/hooks.rb:245 0.005
Given a computer 0.179
And I create a 7200 MiB disk named "old" 0.038
And I plug USB drive "old" 1.043
And I write an old version of the Tails USB image to disk "old" 18.614
When I start Tails from USB drive "old" with network unplugged 1:28.998
Then the boot device has safe access rights 3.502
And Tails is running from USB drive "old" 0.324
And there is no persistence partition on USB drive "old" 0.075
And process "udev-watchdog" is running 0.104
And udev-watchdog is monitoring the correct device 0.303
And I unplug USB drive "old" 0.188
After features/support/hooks.rb:291 3.569
After features/support/hooks.rb:75 0.012
Tags: @product
2:7.086
Before features/support/hooks.rb:245 0.006
Given a computer 0.156
And I start Tails from USB drive "old" with network unplugged and I login 1:15.328
Then Tails is running from USB drive "old" 0.289
And I create a persistent partition 40.854
And I take note of which tps features are available 1.625
Then a Tails persistence partition exists on USB drive "old" 0.797
And I shutdown Tails and wait for the computer to power off 8.033
After features/support/hooks.rb:291 0.176
After features/support/hooks.rb:75 0.011
Tags: @product
2:42.570
Before features/support/hooks.rb:245 0.008
Given a computer 0.170
And I start Tails from USB drive "old" with network unplugged and I login with persistence enabled 2:16.242
Then Tails is running from USB drive "old" 0.279
And all tps features are active 1.787
When I write some files expected to persist 1.639
# Verify that our baseline for the next scenarios is sane
And all persistent filesystems have safe access rights 0.241
And all persistence configuration files have safe access rights 0.424
And all persistent directories from the old Tails version have safe access rights 2.469
And I take note of which tps features are available 0.327
And I shutdown Tails and wait for the computer to power off 4.022
# XXX: how does guestfs work vs snapshots?
Then only the expected files are present on the persistence partition on USB drive "old" 14.964
After features/support/hooks.rb:291 0.123
After features/support/hooks.rb:75 0.012
Tags: @product
2:28.369
Before features/support/hooks.rb:245 0.008
Given I have started Tails without network from a USB drive without a persistent partition and stopped at Tails Greeter's login screen 11.558
And I log in to a new session 16.212
And I clone USB drive "old" to a new USB drive "to_upgrade" 1.908
And I plug USB drive "to_upgrade" 2.446
When I upgrade Tails to USB drive "to_upgrade" by cloning 1:42.563
Then the running Tails is installed on USB drive "to_upgrade" 13.309
And I unplug USB drive "to_upgrade" 0.181
And I unplug USB drive "__internal" 0.188
After features/support/hooks.rb:291 3.713
After features/support/hooks.rb:75 0.000
Tags: @product
2:19.487
Before features/support/hooks.rb:245 0.007
Given a computer 0.154
And I start Tails from USB drive "to_upgrade" with network unplugged and I login with persistence enabled 2:10.800
Then all tps features from the old Tails version are active 1.383
And Tails is running from USB drive "to_upgrade" 0.339
And the boot device has safe access rights 3.109
And the expected persistent files created with the old Tails version are present in the filesystem 1.395
And all persistent directories from the old Tails version have safe access rights 2.304
After features/support/hooks.rb:291 0.719
After features/support/hooks.rb:75 0.008
3:50.164
Scenario Upgrading an initial Tails installation with an incremental upgrade
Before features/support/hooks.rb:245 0.006
Steps
Given I have started Tails without network from a USB drive with a persistent partition enabled and logged in 11.878
And no SquashFS delta is installed 0.093
And Tails is fooled to think that version 6.0~testoverlayfs was initially installed 0.290
And Tails is fooled to think it is running version 6.0~testoverlayfs 0.056
And the file system changes introduced in version 6.2~testoverlayfs are not present 0.316
And the file system changes introduced in version 6.3~testoverlayfs are not present 0.464
When the network is plugged 0.032
And Tor is ready 19.562
Then I am proposed to install an incremental upgrade to version 6.2~testoverlayfs 5.242
And I can successfully install the incremental upgrade to version 6.2~testoverlayfs 12.112
Given I shutdown Tails and wait for the computer to power off 3:0.112
try_for() timeout expired (Timeout::Error)
./features/support/helpers/misc_helpers.rb:145:in `rescue in try_for'
./features/support/helpers/misc_helpers.rb:51:in `try_for'
./features/step_definitions/common_steps.rb:834:in `/^Tails eventually (shuts down|restarts)$/'
./features/step_definitions/common_steps.rb:846:in `/^I shutdown Tails and wait for the computer to power off$/'
features/usb_upgrade.feature:92:in `Given I shutdown Tails and wait for the computer to power off'
When I start Tails from USB drive "__internal" with network unplugged and I login with persistence enabled 0.000
Then Tails is running version 6.2~testoverlayfs 0.000
And all tps features are active 0.000
And the file system changes introduced in version 6.2~testoverlayfs are present 0.000
And only the 6.2~testoverlayfs SquashFS delta is installed 0.000
# Our IUK sets a release date that can make Tor bootstrapping impossible
Given Tails system time is magically synchronized 0.000
# We'll really install Tails_amd64_6.0~testoverlayfs_to_6.3~testoverlayfs.iuk
# but we need some way to force upgrading a second time in a row
# even if only the initially installed version is considered
And Tails is fooled to think that version 6.1~testoverlayfs was initially installed 0.000
When the network is plugged 0.000
And Tor is ready 0.000
Then I am proposed to install an incremental upgrade to version 6.3~testoverlayfs 0.000
And I can successfully install the incremental upgrade to version 6.3~testoverlayfs 0.000
Given I shutdown Tails and wait for the computer to power off 0.000
When I start Tails from USB drive "__internal" with network unplugged and I login with persistence enabled 0.000
Then Tails is running version 6.3~testoverlayfs 0.000
And all tps features are active 0.000
And the file system changes introduced in version 6.3~testoverlayfs are present 0.000
And only the 6.3~testoverlayfs SquashFS delta is installed 0.000
# Regression test for #17425 (i.e. the Upgrader would propose
# upgrading to the version that's already running)
Given Tails system time is magically synchronized 0.000
And Tails is fooled to think that version 6.1~testoverlayfs was initially installed 0.000
When the network is plugged 0.000
And Tor is ready 0.000
Then the Upgrader considers the system as up-to-date 0.000
# Regression test on #8158 (i.e. the IUK's filesystem is not part of the Unsafe Browser's chroot)
And I successfully start the Unsafe Browser 0.000
And the file system changes introduced in version 6.3~testoverlayfs are present in the Unsafe Browser's chroot 0.000
After features/support/hooks.rb:291 9.596

SCENARIO FAILED: 'Upgrading an initial Tails installation with an incremental upgrade' (at time 01:50:24)

Screenshot: https://jenkins.tails.boum.org/job/test_Tails_ISO_stable/4685/artifact/build-artifacts/01:50:24_Upgrading_an_initial_Tails_installation_with_an_incremental_upgrade.png

Video: https://jenkins.tails.boum.org/job/test_Tails_ISO_stable/4685/artifact/build-artifacts/01:50:24_Upgrading_an_initial_Tails_installation_with_an_incremental_upgrade.mkv

After features/support/hooks.rb:75 0.000
34.912
Before features/support/hooks.rb:245 0.006
Given I have started Tails without network from a USB drive with a persistent partition enabled and logged in 10.014
And Tails is fooled to think that version 6.0~testoverlayfs was initially installed 0.282
And Tails is fooled to think it is running version 6.0~testoverlayfs 0.054
And the signing key used by the Upgrader is outdated 0.446
But a current signing key is available on our website 0.000
When the network is plugged 0.037
And Tor is ready 19.129
Then I am proposed to install an incremental upgrade to version 6.2~testoverlayfs 4.945
After features/support/hooks.rb:291 0.801
After features/support/hooks.rb:75 0.000
48.795
Before features/support/hooks.rb:245 0.007
Given I have started Tails from DVD and logged in and the network is connected 40.471
When I eject the boot medium 0.261
Then Tails eventually shuts down 8.063
After features/support/hooks.rb:291 0.313
After features/support/hooks.rb:75 0.000
36.733
Before features/support/hooks.rb:245 0.006
Given I have started Tails from DVD without network and logged in 8.490
And I prepare Tails for memory erasure tests 0.411
And I fill a 128 MiB file with a known pattern on the root filesystem 13.067
And patterns cover at least 128 MiB in the guest's memory 3.738

Pattern coverage: 100.000% (128 MiB out of 128 MiB reference memory)

When I eject the boot medium 0.657
And I wait for Tails to finish wiping the memory 8.693
Then I find very few patterns in the guest's memory 1.674

Pattern coverage: 0.000% (0 MiB out of 938 MiB reference memory)

After features/support/hooks.rb:291 3.516
After features/support/hooks.rb:75 0.000
31.998
Before features/support/hooks.rb:245 0.006
Given I have started Tails from DVD without network and logged in 7.972
And I prepare Tails for memory erasure tests 0.382
And I plug and mount a 128 MiB USB drive with a vfat filesystem 6.784
And I fill the USB drive with a known pattern 2.110
And I read the content of the test FS 0.070
And patterns cover at least 90% of the test FS size in the guest's memory 3.559

Pattern coverage: 100.000% (127 MiB out of 127 MiB reference memory)

When I eject the boot medium 0.310
And I wait for Tails to finish wiping the memory 9.082
Then I find very few patterns in the guest's memory 1.725

Pattern coverage: 0.000% (0 MiB out of 935 MiB reference memory)

After features/support/hooks.rb:291 3.613
After features/support/hooks.rb:75 0.000
52.305
Before features/support/hooks.rb:245 0.006
Given I have started Tails from DVD without network and logged in 8.744
And I prepare Tails for memory erasure tests 0.510
And I plug and mount a 128 MiB USB drive with an ext4 filesystem encrypted with password "asdf" 28.058
And I fill the USB drive with a known pattern 1.298
And I read the content of the test FS 0.063
And patterns cover at least 99% of the test FS size in the guest's memory 2.968

Pattern coverage: 106.113% (97 MiB out of 91 MiB reference memory)

When I eject the boot medium 0.353
And I wait for Tails to finish wiping the memory 8.575
Then I find very few patterns in the guest's memory 1.732

Pattern coverage: 0.000% (0 MiB out of 941 MiB reference memory)

After features/support/hooks.rb:291 3.595
After features/support/hooks.rb:75 0.000
2:10.907
Before features/support/hooks.rb:245 0.006
Given I have started Tails without network from a USB drive with a persistent partition enabled and logged in 9.905
And I prepare Tails for memory erasure tests 0.416
And I fill a 128 MiB file with a known pattern on the persistent filesystem 21.281
And patterns cover at least 100 MiB in the guest's memory 3.489

Pattern coverage: 112.059% (112 MiB out of 100 MiB reference memory)

When I eject the boot medium 0.536
And I wait for Tails to finish wiping the memory 5.118
Then I find very few patterns in the guest's memory 1.792

Pattern coverage: 0.000% (0 MiB out of 944 MiB reference memory)

And Tails eventually shuts down 1:28.366
After features/support/hooks.rb:291 0.173
After features/support/hooks.rb:75 0.000
Tags: @product
51.084
Before features/support/hooks.rb:245 0.006
Given a computer 0.153
And I start Tails from DVD with network unplugged and genuine APT sources 50.617
Then the only hosts in APT sources are "cdn-fastly.deb.debian.org,umjqavufhoix3smyq6az2sx4istmuvsgmz4bq5u5x56rnayejoo6l2qd.onion,apow7mjfryruh65chtdydfmqfpj5btws7nbocgtaovhvezgccyjazpqd.onion" 0.048
And no proposed-updates APT suite is enabled 0.051
And no experimental APT suite is enabled for deb.torproject.org 0.051
And if releasing, no unversioned Tails APT source is enabled 0.147

Not on a tag ⇒ skipping this step

And if releasing, the tagged Tails APT source is enabled 0.014

Not on a tag ⇒ skipping this step

After features/support/hooks.rb:291 0.634
After features/support/hooks.rb:75 0.010
Tags: @product
1:16.316
Before features/support/hooks.rb:245 0.006
Given I have started Tails without network from a USB drive with a persistent partition enabled and logged in 10.948
# The volume cannot be in use when GuestFs clones it, which we do below
And I shutdown Tails and wait for the computer to power off 6.024
And I clone USB drive "__internal" to a temporary USB drive "backup" 1.350
Given I have started Tails without network from a USB drive with a persistent partition enabled and logged in 9.871
And I write a file "/live/persistence/TailsData_unlocked/new" with contents "foo" 0.035
When I start Tails' custom backup tool 12.082
Then the backup tool displays "Plug in your backup Tails USB stick" 3.173
When I plug USB drive "backup" 2.874
And I give the Persistent Storage on drive "backup" its own UUID 0.140
And I click "Retry" in the backup tool 1.150
Then the backup tool displays "Do you want to back up your Persistent Storage now?" 0.194
When I click "Back Up" in the backup tool 1.133
And I enter my persistent storage passphrase into the polkit prompt 14.317
Then the backup tool displays "Your Persistent Storage was backed up successfully to your backup Tails USB stick!" 5.008
# The backup tool ejects the drive, so we have to replug it
When I unplug USB drive "backup" 0.172
And I plug USB drive "backup" 3.239
Then the USB drive "backup" contains the same files as my persistent storage 4.597
After features/support/hooks.rb:291 2.730
After features/support/hooks.rb:75 0.118
Tags: @product
0.174
Then the hostname should not have been leaked on the network 0.174
After features/support/hooks.rb:291 0.593
After features/support/hooks.rb:75 0.039
Tags: @product
0.643
When I add a wired DHCP NetworkManager connection called "manually-added-con" 0.150
And I switch to the "manually-added-con" NetworkManager connection 0.257
Then the hostname should not have been leaked on the network 0.235
After features/support/hooks.rb:291 0.583
After features/support/hooks.rb:75 0.048
37.422
Before features/support/hooks.rb:245 0.007
Given I have started Tails from DVD without network and logged in 8.164
When I start "Tails Documentation" via GNOME Activities Overview 10.625
Then the Tor Browser has started 18.130
Then "Tails - Documentation" has loaded in the Tor Browser 0.501
After features/support/hooks.rb:291 1.224
After features/support/hooks.rb:75 0.000
43.440
Before features/support/hooks.rb:245 0.007
Given I have started Tails from DVD and logged in and the network is connected 13.408
When I start "Tails Documentation" via GNOME Activities Overview 10.545
Then the Tor Browser has started 18.916
Then "Tails - Documentation" has loaded in the Tor Browser 0.570
After features/support/hooks.rb:291 0.710
After features/support/hooks.rb:75 0.000
20.830
Before features/support/hooks.rb:245 0.006
Before features/support/hooks.rb:442 0.006
Given I have started Tails from DVD without network and logged in 7.947
When I start Electrum through the GNOME menu 11.093
But the "electrum" tps feature is not enabled 0.488
And I see a warning that Electrum is not persistent 1.301
After features/support/hooks.rb:450 0.118
After features/support/hooks.rb:291 0.751
After features/support/hooks.rb:75 0.000
Feature: Using Evince
Tags: @product
27.666
Before features/support/hooks.rb:245 0.005
Given I have started Tails from DVD without network and logged in 8.054
When I open "/usr/share/cups/data/default-testpage.pdf" with Evince 12.732
Then I see "CupsTestPage.png" after at most 40 seconds 2.296
And I can print the current document to "/home/amnesia/output.pdf" 4.582
After features/support/hooks.rb:291 0.690
After features/support/hooks.rb:75 0.000
Feature: Using Evince
Tags: @product
28.508
Before features/support/hooks.rb:245 0.007
Given I have started Tails from DVD without network and logged in 8.077
And I copy "/usr/share/cups/data/default-testpage.pdf" to "/home/amnesia" as user "amnesia" 0.146
When I open "/home/amnesia/default-testpage.pdf" with Evince 12.798
Then I see "CupsTestPage.png" after at most 40 seconds 2.768
And I can print the current document to "/home/amnesia/output.pdf" 4.718
After features/support/hooks.rb:291 1.530
After features/support/hooks.rb:75 0.000
Feature: Using Evince
29.239
Before features/support/hooks.rb:245 0.006
Given I have started Tails from DVD without network and logged in 8.355
And I copy "/usr/share/cups/data/default-testpage.pdf" to "/home/amnesia/.gnupg" as user "amnesia" 0.141
Then the file "/home/amnesia/.gnupg/default-testpage.pdf" exists 0.054
And the file "/lib/live/mount/overlay/rw/home/amnesia/.gnupg/default-testpage.pdf" exists after at most 10 seconds 0.049
And the file "/live/overlay/rw/home/amnesia/.gnupg/default-testpage.pdf" exists after at most 10 seconds 0.053
Given I start monitoring the AppArmor log of "/usr/bin/evince" 0.144
When I try to open "/home/amnesia/.gnupg/default-testpage.pdf" with Evince 12.691
Then Evince tells me it cannot open "/home/amnesia/.gnupg/default-testpage.pdf" 1.913
And AppArmor has denied "/usr/bin/evince" from opening "/home/amnesia/.gnupg/default-testpage.pdf" 0.230
When I close Evince 0.176
Given I restart monitoring the AppArmor log of "/usr/bin/evince" 0.135
When I try to open "/lib/live/mount/overlay/rw/home/amnesia/.gnupg/default-testpage.pdf" with Evince 2.143
Then Evince tells me it cannot open "/lib/live/mount/overlay/rw/home/amnesia/.gnupg/default-testpage.pdf" 0.348
And AppArmor has denied "/usr/bin/evince" from opening "/usr/lib/live/mount/overlay/rw/home/amnesia/.gnupg/default-testpage.pdf" 0.056
When I close Evince 0.184
Given I restart monitoring the AppArmor log of "/usr/bin/evince" 0.103
When I try to open "/live/overlay/rw/home/amnesia/.gnupg/default-testpage.pdf" with Evince 2.116
Then Evince tells me it cannot open "/live/overlay/rw/home/amnesia/.gnupg/default-testpage.pdf" 0.279
# Due to our AppArmor aliases, /live/overlay will be treated
# as /usr/lib/live/mount/overlay.
And AppArmor has denied "/usr/bin/evince" from opening "/usr/lib/live/mount/overlay/rw/home/amnesia/.gnupg/default-testpage.pdf" 0.062
After features/support/hooks.rb:291 0.774
After features/support/hooks.rb:75 0.000
Feature: Using Evince
Tags: @product
31.692
Before features/support/hooks.rb:245 0.006
Given I have started Tails without network from a USB drive with a persistent partition enabled and logged in 9.799
And I copy "/usr/share/cups/data/default-testpage.pdf" to "/home/amnesia/Persistent" as user "amnesia" 0.154
Then the file "/home/amnesia/Persistent/default-testpage.pdf" exists 0.058
When I open "/home/amnesia/Persistent/default-testpage.pdf" with Evince 13.857
Then I see "CupsTestPage.png" after at most 40 seconds 2.774
And I can print the current document to "/home/amnesia/Persistent/output.pdf" 5.048
After features/support/hooks.rb:291 0.828
After features/support/hooks.rb:75 0.000
Feature: Using Evince
25.487
Before features/support/hooks.rb:245 0.007
Given I have started Tails without network from a USB drive with a persistent partition enabled and logged in 9.542
And I copy "/usr/share/cups/data/default-testpage.pdf" to "/home/amnesia/.gnupg" as user "amnesia" 0.153
Then the file "/home/amnesia/.gnupg/default-testpage.pdf" exists 0.074
Given I start monitoring the AppArmor log of "/usr/bin/evince" 0.129
And I try to open "/home/amnesia/.gnupg/default-testpage.pdf" with Evince 13.739
Then Evince tells me it cannot open "/home/amnesia/.gnupg/default-testpage.pdf" 1.479
And AppArmor has denied "/usr/bin/evince" from opening "/home/amnesia/.gnupg/default-testpage.pdf" 0.367
After features/support/hooks.rb:291 0.749
After features/support/hooks.rb:75 0.000
19.396
Before features/support/hooks.rb:245 0.006
Given I have started Tails from DVD without network and logged in 7.971
And I wait 10 seconds 10.002

Slept for 10 seconds

And there is no screenshot in the live user's Pictures directory 0.064
When I press the "PRINTSCREEN" key 0.121
And GNOME offers me various screenshot options 1.066
And I press the "Return" key 0.121
Then a screenshot is saved to the live user's Pictures directory 0.048
After features/support/hooks.rb:291 0.680
After features/support/hooks.rb:75 0.000
Tags: @product
8.686
Before features/support/hooks.rb:245 0.007
Given I have started Tails from DVD without network and logged in 8.001
When the "Dogtail rules!" notification is sent 0.157
Then the "Dogtail rules!" notification is shown to the user 0.526
After features/support/hooks.rb:291 0.657
After features/support/hooks.rb:75 0.000
Tags: @product
37.431
Before features/support/hooks.rb:245 0.007
Given a computer 0.148
And I start the computer from DVD with network unplugged 34.497
When Tails detects disk read failures 0.771
Then I see a disk failure message on the splash screen 2.013
After features/support/hooks.rb:291 0.626
After features/support/hooks.rb:75 0.010
Tags: @product @doc
27.578
Before features/support/hooks.rb:245 0.006
Given a computer 0.148
And I have started Tails from DVD without network and logged in 7.954
When Tails detects disk read failures 0.511
Then I see a disk failure message 1.269
Then I can open the hardware failure documentation from the disk failure message 17.695
After features/support/hooks.rb:291 1.485
After features/support/hooks.rb:75 0.000
Feature: Hardware support
Tags: @product
49.155
Before features/support/hooks.rb:245 0.006
Given a computer 0.138
And I start the computer from DVD with network unplugged and an unsupported graphics card 34.172
Then I see a graphics card failure message on the splash screen 14.844
After features/support/hooks.rb:291 0.698
After features/support/hooks.rb:75 0.010
Tags: @product @doc
9.995
Before features/support/hooks.rb:245 0.005
Given I have started Tails from DVD without network and logged in 8.010
Then the included OpenPGP keys are valid for the next 1 month 1.985
After features/support/hooks.rb:291 0.676
After features/support/hooks.rb:75 0.000
Tags: @product
19.939
Before features/support/hooks.rb:245 0.006
Given I have started Tails from DVD without network and logged in 8.031
Then the keys trusted by APT are valid for the next 3 months 11.907
After features/support/hooks.rb:291 0.688
After features/support/hooks.rb:75 0.000
Feature: Localization
Tags: @product
42.839
Before features/support/hooks.rb:245 0.008
Given I have started Tails from DVD without network and stopped at Tails Greeter's login screen 10.932
And I log in to a new session in German (de) 29.400
Then the amnesiac Documents directory exists 0.055
And there is a GNOME bookmark for the amnesiac Documents directory 2.451
After features/support/hooks.rb:291 0.683
After features/support/hooks.rb:75 0.000
Feature: Localization
Tags: @product
40.654
Before features/support/hooks.rb:245 0.007
Given I have started Tails from DVD without network and stopped at Tails Greeter's login screen 8.841
And I log in to a new session in German (de) 29.919
Then the amnesiac Downloads directory exists 0.053
And there is a GNOME bookmark for the amnesiac Downloads directory 1.839
After features/support/hooks.rb:291 1.054
After features/support/hooks.rb:75 0.000
Feature: Localization
Tags: @product
40.160
Before features/support/hooks.rb:245 0.006
Given I have started Tails from DVD without network and stopped at Tails Greeter's login screen 8.244
And I log in to a new session in German (de) 29.440
Then the amnesiac Music directory exists 0.055
And there is a GNOME bookmark for the amnesiac Music directory 2.420
After features/support/hooks.rb:291 0.654
After features/support/hooks.rb:75 0.000
Feature: Localization
Tags: @product
38.429
Before features/support/hooks.rb:245 0.007
Given I have started Tails from DVD without network and stopped at Tails Greeter's login screen 7.858
And I log in to a new session in German (de) 28.346
Then the amnesiac Pictures directory exists 0.054
And there is a GNOME bookmark for the amnesiac Pictures directory 2.170
After features/support/hooks.rb:291 0.665
After features/support/hooks.rb:75 0.000
Feature: Localization
Tags: @product
38.449
Before features/support/hooks.rb:245 0.007
Given I have started Tails from DVD without network and stopped at Tails Greeter's login screen 7.819
And I log in to a new session in German (de) 28.626
Then the amnesiac Videos directory exists 0.068
And there is a GNOME bookmark for the amnesiac Videos directory 1.935
After features/support/hooks.rb:291 0.911
After features/support/hooks.rb:75 0.000
Feature: Localization
2:21.936
Before features/support/hooks.rb:245 0.005
Given I have started Tails from DVD without network and stopped at Tails Greeter's login screen 7.752
When I log in to a new session in Arabic (ar) 27.885
Then the keyboard layout is set to "us" 0.166
When the network is plugged 0.037
And Tor is ready 13.980
Then I successfully start the Unsafe Browser in "ar" 13.167
And I kill the Unsafe Browser 5.897
When I enable the screen keyboard 0.101
Then the screen keyboard works in Tor Browser 34.773
And DuckDuckGo is the default search engine 10.164
And I kill the Tor Browser 5.712
And the screen keyboard works in Thunderbird 21.755
And the layout of the screen keyboard is set to "us" 0.539
After features/support/hooks.rb:291 0.777
After features/support/hooks.rb:75 0.000
Feature: Localization
2:57.245
Before features/support/hooks.rb:245 0.006
Given I have started Tails from DVD without network and stopped at Tails Greeter's login screen 8.063
When I log in to a new session in Chinese (zh_CN) 28.842
Then the keyboard layout is set to "cn" 0.174
When the network is plugged 0.030
And Tor is ready 42.857
Then I successfully start the Unsafe Browser in "zh_CN" 13.996
And I kill the Unsafe Browser 5.651
When I enable the screen keyboard 0.110
Then the screen keyboard works in Tor Browser 35.422
And DuckDuckGo is the default search engine 10.472
And I kill the Tor Browser 5.756
And the screen keyboard works in Thunderbird 25.282
And the layout of the screen keyboard is set to "us" 0.582
After features/support/hooks.rb:291 1.105
After features/support/hooks.rb:75 0.000
Feature: Localization
2:0.047
Before features/support/hooks.rb:245 0.007
Given I have started Tails from DVD without network and stopped at Tails Greeter's login screen 7.998
When I log in to a new session in English (en) 14.289
Then the keyboard layout is set to "us" 0.150
When the network is plugged 0.028
And Tor is ready 13.290
Then I successfully start the Unsafe Browser in "en" 13.533
And I kill the Unsafe Browser 5.704
When I enable the screen keyboard 0.125
Then the screen keyboard works in Tor Browser 33.129
And DuckDuckGo is the default search engine 5.108
And I kill the Tor Browser 5.271
And the screen keyboard works in Thunderbird 20.836
And the layout of the screen keyboard is set to "us" 0.580
After features/support/hooks.rb:291 1.285
After features/support/hooks.rb:75 0.000
Feature: Localization
2:30.120
Before features/support/hooks.rb:245 0.008
Given I have started Tails from DVD without network and stopped at Tails Greeter's login screen 7.920
When I log in to a new session in French (fr) 29.173
Then the keyboard layout is set to "fr" 0.110
When the network is plugged 0.037
And Tor is ready 13.166
Then I successfully start the Unsafe Browser in "fr" 14.026
And I kill the Unsafe Browser 5.727
When I enable the screen keyboard 0.079
Then the screen keyboard works in Tor Browser 34.310
And DuckDuckGo is the default search engine 18.507
And I kill the Tor Browser 5.580
And the screen keyboard works in Thunderbird 20.942
And the layout of the screen keyboard is set to "fr" 0.536
After features/support/hooks.rb:291 0.987
After features/support/hooks.rb:75 0.000
Feature: Localization
2:18.986
Before features/support/hooks.rb:245 0.005
Given I have started Tails from DVD without network and stopped at Tails Greeter's login screen 7.939
When I log in to a new session in German (de) 28.268
Then the keyboard layout is set to "de" 0.144
When the network is plugged 0.025
And Tor is ready 14.826
Then I successfully start the Unsafe Browser in "de" 13.388
And I kill the Unsafe Browser 5.919
When I enable the screen keyboard 0.114
Then the screen keyboard works in Tor Browser 32.090
And DuckDuckGo is the default search engine 10.410
And I kill the Tor Browser 5.458
And the screen keyboard works in Thunderbird 19.827
And the layout of the screen keyboard is set to "de" 0.572
After features/support/hooks.rb:291 0.976
After features/support/hooks.rb:75 0.000
Feature: Localization
2:20.573
Before features/support/hooks.rb:245 0.005
Given I have started Tails from DVD without network and stopped at Tails Greeter's login screen 7.926
When I log in to a new session in Italian (it) 28.052
Then the keyboard layout is set to "it" 0.163
When the network is plugged 0.028
And Tor is ready 12.938
Then I successfully start the Unsafe Browser in "it" 13.656
And I kill the Unsafe Browser 5.646
When I enable the screen keyboard 0.101
Then the screen keyboard works in Tor Browser 34.487
And DuckDuckGo is the default search engine 10.830
And I kill the Tor Browser 5.472
And the screen keyboard works in Thunderbird 20.721
And the layout of the screen keyboard is set to "us" 0.547
After features/support/hooks.rb:291 1.098
After features/support/hooks.rb:75 0.000
Feature: Localization
2:25.500
Before features/support/hooks.rb:245 0.008
Given I have started Tails from DVD without network and stopped at Tails Greeter's login screen 8.553
When I log in to a new session in Persian (fa) 28.888
Then the keyboard layout is set to "ir" 0.138
When the network is plugged 0.030
And Tor is ready 14.922
Then I successfully start the Unsafe Browser in "fa" 13.478
And I kill the Unsafe Browser 5.941
When I enable the screen keyboard 0.107
Then the screen keyboard works in Tor Browser 34.950
And DuckDuckGo is the default search engine 11.047
And I kill the Tor Browser 5.456
And the screen keyboard works in Thunderbird 21.447
And the layout of the screen keyboard is set to "ir" 0.537
After features/support/hooks.rb:291 1.456
After features/support/hooks.rb:75 0.000
Feature: Localization
2:18.222
Before features/support/hooks.rb:245 0.005
Given I have started Tails from DVD without network and stopped at Tails Greeter's login screen 7.781
When I log in to a new session in Portuguese (pt) 27.981
Then the keyboard layout is set to "pt" 0.194
When the network is plugged 0.041
And Tor is ready 13.076
Then I successfully start the Unsafe Browser in "pt" 13.449
And I kill the Unsafe Browser 5.652
When I enable the screen keyboard 0.115
Then the screen keyboard works in Tor Browser 32.427
And DuckDuckGo is the default search engine 10.343
And I kill the Tor Browser 5.476
And the screen keyboard works in Thunderbird 21.130
And the layout of the screen keyboard is set to "us" 0.551
After features/support/hooks.rb:291 1.232
After features/support/hooks.rb:75 0.000
Feature: Localization
2:22.759
Before features/support/hooks.rb:245 0.004
Given I have started Tails from DVD without network and stopped at Tails Greeter's login screen 8.100
When I log in to a new session in Russian (ru) 28.483
Then the keyboard layout is set to "ru" 0.126
When the network is plugged 0.027
And Tor is ready 13.402
Then I successfully start the Unsafe Browser in "ru" 13.132
And I kill the Unsafe Browser 5.727
When I enable the screen keyboard 0.074
Then the screen keyboard works in Tor Browser 34.923
And DuckDuckGo is the default search engine 10.139
And I kill the Tor Browser 5.461
And the screen keyboard works in Thunderbird 22.535
And the layout of the screen keyboard is set to "ru" 0.624
After features/support/hooks.rb:291 0.929
After features/support/hooks.rb:75 0.000
Feature: Localization
2:20.187
Before features/support/hooks.rb:245 0.004
Given I have started Tails from DVD without network and stopped at Tails Greeter's login screen 7.849
When I log in to a new session in Spanish (es) 28.587
Then the keyboard layout is set to "es" 0.126
When the network is plugged 0.039
And Tor is ready 13.972
Then I successfully start the Unsafe Browser in "es" 13.653
And I kill the Unsafe Browser 5.651
When I enable the screen keyboard 0.110
Then the screen keyboard works in Tor Browser 32.405
And DuckDuckGo is the default search engine 10.577
And I kill the Tor Browser 5.550
And the screen keyboard works in Thunderbird 21.077
And the layout of the screen keyboard is set to "us" 0.586
After features/support/hooks.rb:291 1.049
After features/support/hooks.rb:75 0.000
Feature: Localization
2:18.800
Before features/support/hooks.rb:245 0.004
Given I have started Tails from DVD without network and stopped at Tails Greeter's login screen 7.825
When I log in to a new session in Turkish (tr) 28.397
Then the keyboard layout is set to "tr" 0.204
When the network is plugged 0.035
And Tor is ready 12.920
Then I successfully start the Unsafe Browser in "tr" 13.564
And I kill the Unsafe Browser 5.974
When I enable the screen keyboard 0.129
Then the screen keyboard works in Tor Browser 32.141
And DuckDuckGo is the default search engine 10.359
And I kill the Tor Browser 5.475
And the screen keyboard works in Thunderbird 21.177
And the layout of the screen keyboard is set to "us" 0.594
After features/support/hooks.rb:291 1.175
After features/support/hooks.rb:75 0.000
Tags: @product
40.218
Before features/support/hooks.rb:245 0.006
Given I have started Tails from DVD without network and stopped at Tails Greeter's login screen 8.071
And I capture all network traffic 0.006
When I disable MAC spoofing in Tails Greeter 3.589
And I log in to a new session 14.858
And the network is plugged 0.020
And Tor is ready 11.682
Then 1 network interface is enabled 0.096
And the 1st network device has its real MAC address configured 0.105
When I hotplug a network device and wait for it to be initialized 1.354
Then 2 network interfaces are enabled 0.067
And the 2nd network device has its real MAC address configured 0.073
And some network device leaked the real MAC address 0.290
After features/support/hooks.rb:291 0.817
After features/support/hooks.rb:75 0.046
Tags: @product
1:7.583
Before features/support/hooks.rb:245 0.004
Given I have started Tails from DVD without network and stopped at Tails Greeter's login screen 7.842
And I capture all network traffic 0.006
When I log in to a new session 14.151
And the network is plugged 0.053
And Tor is ready 43.590
Then 1 network interface is enabled 0.081
And the 1st network device has a spoofed MAC address configured 0.077
When I hotplug a network device and wait for it to be initialized 1.351
Then 2 network interfaces are enabled 0.084
And the 2nd network device has a spoofed MAC address configured 0.068
And no network device leaked the real MAC address 0.276
After features/support/hooks.rb:291 0.830
After features/support/hooks.rb:75 0.051
Tags: @product
2:26.337
Before features/support/hooks.rb:245 0.006
Given I have started Tails from DVD without network and stopped at Tails Greeter's login screen 7.820
And I capture all network traffic 0.007
And the network is plugged 0.029
And macchanger will fail by not spoofing and always returns false 0.153
When I log in to a new session 2:11.194
Then no network interfaces are enabled 0.101
And no network device leaked the real MAC address 0.014
And I see the "Network card eth0 disabled" notification after at most 60 seconds 7.016
After features/support/hooks.rb:291 0.628
After features/support/hooks.rb:75 0.062
Tags: @product
2:26.314
Before features/support/hooks.rb:245 0.006
Given I have started Tails from DVD without network and stopped at Tails Greeter's login screen 7.876
And I capture all network traffic 0.006
And the network is plugged 0.032
And macchanger will fail by not spoofing and always returns true 0.174
When I log in to a new session 2:11.100
Then no network interfaces are enabled 0.140
And no network device leaked the real MAC address 0.011
And I see the "Network card eth0 disabled" notification after at most 60 seconds 6.973
After features/support/hooks.rb:291 0.691
After features/support/hooks.rb:75 0.034
Tags: @product
2:27.291
Before features/support/hooks.rb:245 0.005
Given I have started Tails from DVD without network and stopped at Tails Greeter's login screen 7.794
And I capture all network traffic 0.006
And the network is plugged 0.051
And macchanger will fail by not spoofing and always returns true 0.140
And no network interface modules can be unloaded 0.356
When I log in to a new session 2:11.552
Then 1 network interface is enabled 0.117
But the MAC spoofing panic mode disabled networking 0.642
And no network device leaked the real MAC address 0.010
And I see the "All networking disabled" notification after at most 60 seconds 6.618
After features/support/hooks.rb:291 0.630
After features/support/hooks.rb:75 0.044
Tags: @product
51.473
Before features/support/hooks.rb:245 0.004
Given a computer 0.150
And I capture all network traffic 0.004
When I start the computer 0.932
Then the computer boots Tails 50.241
And no network interfaces are enabled 0.133
And no network device leaked the real MAC address 0.011
After features/support/hooks.rb:291 0.613
After features/support/hooks.rb:75 0.050
1:21.217
Before features/support/hooks.rb:245 0.005
Given a computer 0.155
And I start Tails from DVD with network unplugged and I login 1:7.580
And I plug and mount a USB drive containing a sample PNG 11.855
Then MAT can clean some sample PNG file 1.625
After features/support/hooks.rb:291 0.636
After features/support/hooks.rb:75 0.009
Feature: Networking
Tags: @product
55.137
Before features/support/hooks.rb:245 0.006
Given I have started Tails from DVD without network and logged in 8.155
And I wait between 30 and 60 seconds 31.031

Slept for 31 seconds

Then the Tor Status icon tells me that Tor is not usable 0.728
When the network is plugged 0.036
Then I successfully configure Tor 11.309
And the Tor Status icon tells me that Tor is usable 0.754
And all notifications have disappeared 3.063
And the time has synced 0.056
After features/support/hooks.rb:291 0.654
After features/support/hooks.rb:75 0.000
Feature: Networking
33.689
Before features/support/hooks.rb:245 0.006
Given I have started Tails from DVD without network and stopped at Tails Greeter's login screen 7.899
And I disable networking in Tails Greeter 0.944
And I log in to a new session 14.312
Then no network interfaces are enabled 0.163
When I hotplug a network device 0.170
And I wait 10 seconds 10.000

Slept for 10 seconds

Then no network interfaces are enabled 0.198
After features/support/hooks.rb:291 0.659
After features/support/hooks.rb:75 0.000
Tags: @product
2:14.221
Before features/support/hooks.rb:245 0.006
Given I have started Tails from DVD and logged in with an administration password and the network is connected 1:33.761
And I update APT using apt 18.216
And I install "python3-behave" using apt 19.443
Then the Tails Persistent Storage behave tests pass 2.799
After features/support/hooks.rb:291 0.625
After features/support/hooks.rb:75 0.000
Tags: @product
37.425
Before features/support/hooks.rb:245 0.005
Given I have started Tails without network from a USB drive with a persistent partition and stopped at Tails Greeter's login screen 12.735
When I log in to a new session without activating the Persistent Storage 17.423
Then Tails is running from USB drive "__internal" 0.339
And persistence is disabled 0.260
But a Tails persistence partition exists on USB drive "__internal" 6.668
After features/support/hooks.rb:291 1.121
After features/support/hooks.rb:75 0.000
Tags: @product
3:5.617
Before features/support/hooks.rb:245 0.006
Given I have started Tails without network from a USB drive without a persistent partition and logged in 11.203
Then Tails is running from USB drive "__internal" 0.366
When I create a file in the Persistent directory 0.118
And I create a persistent partition with the default settings 33.734
Then the file I created was copied to the Persistent Storage 0.539
When I shutdown Tails and wait for the computer to power off 12.112
And I start Tails from USB drive "__internal" with network unplugged and I login with persistence enabled 2:7.218
Then persistence for "Persistent" is active 0.259
And the file I created in the Persistent directory exists 0.066
After features/support/hooks.rb:291 0.947
After features/support/hooks.rb:75 0.009
Tags: @product
1:4.357
Before features/support/hooks.rb:245 0.006
Given I have started Tails without network from a USB drive without a persistent partition and logged in 10.397
And the system is very low on memory 3.490
When I create a file in the Persistent directory 1.060
When I try to create a persistent partition 22.815
Then The Persistent Storage app shows the error message "Not enough memory to create Persistent Storage" 0.197
When I close the Persistent Storage app 2.481
And I free up some memory 1.599
And I create a persistent partition with the default settings 22.095
Then the file I created was copied to the Persistent Storage 0.220
After features/support/hooks.rb:291 1.319
After features/support/hooks.rb:75 0.000
Tags: @product
2:59.586
Before features/support/hooks.rb:245 0.007
Given I have started Tails without network from a USB drive with a persistent partition enabled and logged in 10.164
Then Tails is running from USB drive "__internal" 0.470
And all tps features are active 2.281
And all persistent directories have safe access rights 2.601
When I disable the first tps feature 16.073
Then all tps features but the first one are active 1.542
And I shutdown Tails and wait for the computer to power off 6.127
And I start Tails from USB drive "__internal" with network unplugged and I login with persistence enabled 2:18.617
Then all tps features but the first one are active 1.706
After features/support/hooks.rb:291 0.969
After features/support/hooks.rb:75 0.009
Tags: @product
39.503
Before features/support/hooks.rb:245 0.006
Given I have started Tails without network from a USB drive with a persistent partition enabled and logged in 9.806
Then persistence for "Persistent" is active 0.062
And I create a file in the Persistent directory 0.057
Then the file I created was copied to the Persistent Storage 0.061
When I disable the first tps feature 16.195
Then persistence for "Persistent" is not active 0.080
And the Persistent directory does not exist 0.039
When I enable the first tps feature 13.065
Then persistence for "Persistent" is active 0.076
And the file I created in the Persistent directory exists 0.057
After features/support/hooks.rb:291 0.983
After features/support/hooks.rb:75 0.000
Tags: @product
38.531
Before features/support/hooks.rb:245 0.006
Given I have started Tails without network from a USB drive with a persistent partition enabled and logged in 9.248
Then persistence for "Persistent" is active 0.067
When I create a file in the Persistent directory 0.073
And I disable the first tps feature 15.772
And I delete the data of the Persistent Folder feature 13.158
Then the file I created does not exist on the Persistent Storage 0.211
After features/support/hooks.rb:291 0.902
After features/support/hooks.rb:75 0.000
Tags: @product
48.716
Before features/support/hooks.rb:245 0.005
Given I have started Tails without network from a USB drive with a persistent partition enabled and logged in 9.079
And the network is plugged 0.025
And Tor is ready 17.003
And I take note of which tps features are available 0.466
When I write some files expected to persist 1.347
And I shutdown Tails and wait for the computer to power off 6.107
# XXX: The next step succeeds (and the --debug output confirms that it's actually looking for the files) but will fail in a subsequent scenario restoring the same snapshot. This exactly what we want, but why does it work? What is guestfs's behaviour when qcow2 internal snapshots are involved?
Then only the expected files are present on the persistence partition on USB drive "__internal" 14.686
After features/support/hooks.rb:291 0.140
After features/support/hooks.rb:75 0.000
Tags: @product
3:2.309
Before features/support/hooks.rb:245 0.005
Given I have started Tails without network from a USB drive with a persistent partition enabled and logged in 9.558
And the network is plugged 0.042
And Tor is ready 19.203
And I add a wired DHCP NetworkManager connection called "persistent-con-current" 0.192
And I shutdown Tails and wait for the computer to power off 6.058
Given I start Tails from USB drive "__internal" with network unplugged and I login with persistence enabled 2:7.112
And I capture all network traffic 0.007
And the network is plugged 0.032
And Tor is ready 19.460
And I switch to the "persistent-con-current" NetworkManager connection 0.326
And the 1st network device has a spoofed MAC address configured 0.072
And no network device leaked the real MAC address 0.241
After features/support/hooks.rb:291 0.625
After features/support/hooks.rb:75 0.044
Tags: @product
49.994
Before features/support/hooks.rb:245 0.006
Given I have started Tails without network from a USB drive without a persistent partition and stopped at Tails Greeter's login screen 11.329
And I enable persistence creation in Tails Greeter 1.334
And I log in to a new session expecting no warning about the Persistent Storage not being activated 17.197
Then I create a persistent partition with the default settings using the wizard that was already open 20.132
After features/support/hooks.rb:291 1.700
After features/support/hooks.rb:75 0.000
Tags: @product
4:45.867
Before features/support/hooks.rb:245 0.006
Given I have started Tails without network from a USB drive with a persistent partition and stopped at Tails Greeter's login screen 11.912
When I enable persistence 35.839
Then no persistent Greeter options were restored 14.390
When I set all Greeter options to non-default values 22.251
And I log in to a new session in German (de) after having activated the Persistent Storage 46.029
Then all Greeter options are set to non-default values 0.333
When I cold reboot the computer 5.981
And the computer reboots Tails 53.367
Given I enable persistence 48.489
Then persistent Greeter options were restored 14.891
When I log in to a new session after having activated the Persistent Storage 32.024
Then all Greeter options are set to non-default values 0.356
After features/support/hooks.rb:291 0.970
After features/support/hooks.rb:75 0.009
Tags: @product
4:9.815
Before features/support/hooks.rb:245 0.004
Given I have started Tails without network from a USB drive with a persistent partition enabled and logged in 9.463
# Note that if anything fails after the passphrase was changed and
# before it's changed back below, subsequent scenarios might fail
# because the Persistent Storage doesn't have the expected passphrase.
When I change the passphrase of the Persistent Storage 48.113
And I shutdown Tails and wait for the computer to power off 12.027
Then I start Tails from USB drive "__internal" with network unplugged and I login with the changed persistence passphrase 2:9.788
And I change the passphrase of the Persistent Storage back to the original 50.422
After features/support/hooks.rb:291 1.335
After features/support/hooks.rb:75 0.010
Tags: @product
58.518
Before features/support/hooks.rb:245 0.007
Given I have started Tails without network from a USB drive with a persistent partition and stopped at Tails Greeter's login screen 10.455
And I log in to a new session without activating the Persistent Storage 17.053
Then persistence is disabled 0.210
But a Tails persistence partition exists on USB drive "__internal" 5.700
And all notifications have disappeared 7.956
When I delete the persistent partition 16.793
Then there is no persistence partition on USB drive "__internal" 0.350
After features/support/hooks.rb:291 0.825
After features/support/hooks.rb:75 0.000
Tags: @product
2:26.006
Before features/support/hooks.rb:245 0.006
Given I have started Tails without network from a USB drive with a persistent partition enabled and logged in 9.625
When I write some dotfile expected to persist 0.067
And I shutdown Tails and wait for the computer to power off 7.023
And I start Tails from USB drive "__internal" with network unplugged and I login with persistence enabled 2:8.994
Then the expected persistent dotfile is present in the filesystem 0.296
After features/support/hooks.rb:291 0.863
After features/support/hooks.rb:75 0.008
Tags: @product
3:39.814
Scenario Feature activation fails
Before features/support/hooks.rb:245 0.005
Steps
Given I have started Tails without network from a USB drive with a persistent partition and stopped at Tails Greeter's login screen 8.789
And I create a symlink "/home/amnesia/Persistent" to "/etc" 0.088
When I try to enable persistence 0.242
Then the Welcome Screen tells me that the Persistent Folder feature couldn't be activated 25.506
When I log in to a new session after having activated the Persistent Storage 3:5.187
cannot find GnomeApplicationsMenu.png on the screen (FindFailed)
./features/support/helpers/screen.rb:166:in `rescue in wait'
./features/support/helpers/screen.rb:159:in `wait'
./features/step_definitions/common_steps.rb:561:in `/^the Tails desktop is ready$/'
./features/step_definitions/common_steps.rb:516:in `/^I log in to a new session(?: in ([^ ]*) \(([^ ]*)\))?( without activating the Persistent Storage)?( after having activated the Persistent Storage| expecting no warning about the Persistent Storage not being activated)?$/'
features/persistence.feature:147:in `When I log in to a new session after having activated the Persistent Storage'
Then the Persistent Storage settings tell me that the Persistent Folder feature couldn't be activated 0.000
And all tps features are enabled 0.000
And all tps features but the first one are active 0.000
After features/support/hooks.rb:291 4.666

SCENARIO FAILED: 'Feature activation fails' (at time 03:22:15)

Screenshot: https://jenkins.tails.boum.org/job/test_Tails_ISO_stable/4685/artifact/build-artifacts/03:22:15_Feature_activation_fails.png

Video: https://jenkins.tails.boum.org/job/test_Tails_ISO_stable/4685/artifact/build-artifacts/03:22:15_Feature_activation_fails.mkv

Boot log: https://jenkins.tails.boum.org/job/test_Tails_ISO_stable/4685/artifact/build-artifacts/03:22:15_Feature_activation_fails.boot-log

Systemd journal: https://jenkins.tails.boum.org/job/test_Tails_ISO_stable/4685/artifact/build-artifacts/03:22:15_Feature_activation_fails.journal

After features/support/hooks.rb:75 0.000
Tags: @product
3:48.733
Before features/support/hooks.rb:245 0.006
Given I have started Tails without network from a USB drive with a LUKS 1 persistent partition and stopped at Tails Greeter's login screen 2:35.154
And I enable persistence 32.571
And I log in to a new session after having activated the Persistent Storage 39.654
Then a Tails persistence partition with LUKS version 2 and argon2id exists on USB drive "__internal" 1.167
And persistence is enabled 0.185
After features/support/hooks.rb:291 1.538
After features/support/hooks.rb:75 0.000
Tags: @product
41.458
Before features/support/hooks.rb:245 0.006
Given I have started Tails without network from a USB drive with a LUKS 1 persistent partition and stopped at Tails Greeter's login screen 8.607
And I enable persistence but something goes wrong during the LUKS header upgrade 32.133
Then the Tails persistence partition on USB drive "__internal" still has LUKS version 1 0.717
After features/support/hooks.rb:291 0.687
After features/support/hooks.rb:75 0.000
Tags: @product
16.042
When I choose to connect to Tor automatically 1.753
And I accept Tor Connection's offer to use my persistent bridges 1.644
And I click "Connect to Tor" 1.233
Then I wait until Tor is ready 9.732
And tca.conf includes the configured bridges 0.011
And the "TorConfiguration" tps feature is enabled and active 0.833
And all Internet traffic has only flowed through the configured bridges or connectivity check service 0.834
After features/support/hooks.rb:291 0.645
After features/support/hooks.rb:75 0.101
Tags: @product
18.688
When I choose to connect to Tor automatically 1.629
And I accept Tor Connection's offer to use my persistent bridges 1.702
And I disable saving bridges to Persistent Storage 1.232
And I configure a direct connection in the Tor Connection Assistant 8.930
Then I wait until Tor is ready 3.379
And tca.conf includes no bridge 0.010
And the "TorConfiguration" tps feature is not enabled and not active 0.802
And all Internet traffic has only flowed through Tor or connectivity check service 1.002
After features/support/hooks.rb:291 0.641
After features/support/hooks.rb:75 0.048
Tags: @product
10.088
Before features/support/hooks.rb:245 0.006
Given I have started Tails from DVD without network and logged in 9.690
Then the live user has been setup by live-boot 0.138
And the live user is a member of only its own group and "cdrom dialout floppy video plugdev netdev scanner lp lpadmin users" 0.088
And the live user owns its home directory which has strict permissions 0.171
After features/support/hooks.rb:291 0.689
After features/support/hooks.rb:75 0.000
19.529
Before features/support/hooks.rb:245 0.006
Given I have started Tails from DVD without network and logged in 8.427
When the network is plugged 0.042
And Tor is ready 10.773
Then no unexpected services are listening for network connections 0.285

Service 'cups-browsed' is listening on 0.0.0.0:631 but has an exception

Service 'onion-grater' is listening on 0.0.0.0:951 but has an exception

Service 'tor' is listening on 10.200.1.1:9050 but has an exception

After features/support/hooks.rb:291 0.728
After features/support/hooks.rb:75 0.000
Tags: @product
22.481
Before features/support/hooks.rb:245 0.006
Given I have started Tails from DVD and logged in and the network is connected 13.717
When I request a shutdown using the system menu 1.683
Then Tails eventually shuts down 7.081
After features/support/hooks.rb:291 0.163
After features/support/hooks.rb:75 0.000
1:18.863
Before features/support/hooks.rb:245 0.006
Given I have started Tails from DVD and logged in and the network is connected 12.763
When I request a reboot using the system menu 1.572
Then Tails eventually restarts 1:4.527
After features/support/hooks.rb:291 3.685
After features/support/hooks.rb:75 0.000
16.830
Given I monitor the network connections of SSH 0.068
And I have the SSH key pair for an SSH server 0.283
When I connect to an SSH server on the Internet 15.159
Then I have sucessfully logged into the SSH server 1.293
And I see that SSH is properly stream isolated 0.025
After features/support/hooks.rb:450 0.428
After features/support/hooks.rb:291 0.640
After features/support/hooks.rb:75 0.000
16.873
Given I have the SSH key pair for an SSH server 0.243
And an SSH server is running on the LAN 0.398
When I connect to an SSH server on the LAN 14.598
Then I am prompted to verify the SSH fingerprint for the SSH server 1.633
After features/support/hooks.rb:450 0.454
After features/support/hooks.rb:291 0.635
After features/support/hooks.rb:75 0.001
20.677
Given I have the SSH key pair for an SFTP server 0.202
When I connect to an SFTP server on the Internet 19.042
Then I successfully connect to the SFTP server 1.432
After features/support/hooks.rb:450 0.529
After features/support/hooks.rb:291 1.127
After features/support/hooks.rb:75 0.000
16.602
Given I cancel setting up an email account 2.866
When I open Thunderbird's Add-ons Manager 1.998
And I open the Extensions tab 1.096
Then I see that no add-ons are enabled in Thunderbird 10.641
After features/support/hooks.rb:450 0.817
After features/support/hooks.rb:291 0.935
After features/support/hooks.rb:75 0.000
43.323
When I enter my email credentials into the autoconfiguration wizard 9.681
Then the autoconfiguration wizard's choice for the incoming server is secure IMAP 0.357
And the autoconfiguration wizard's choice for the outgoing server is secure SMTP 0.418
When I accept the autoconfiguration wizard's configuration 18.449
And I send an email to myself 6.139
And I fetch my email 1.578
Then I can find the email I sent to myself in my inbox 6.699
After features/support/hooks.rb:450 1.486
After features/support/hooks.rb:291 0.950
After features/support/hooks.rb:75 0.000
8.821
When the network is plugged 0.050
And the Tor Connection Assistant autostarts 3.194
And I look at the hide mode but then I go back 3.994
And I choose to connect to Tor automatically 1.451
Then Tor Connection does not propose me to use Tor bridges 0.129
After features/support/hooks.rb:291 0.652
After features/support/hooks.rb:75 0.000
Tags: @product
1:20.168
Given the Tor network and default bridges are blocked 1.428
And the network is plugged 0.057
And I make sure time sync before Tor connects indicates a captive portal 1.230
And the Tor Connection Assistant autostarts 2.064
When I choose to connect to Tor automatically 1.533
And I click "Connect to Tor" 1.164
Then the Tor Connection Assistant fails to connect to Tor 26.398
And the Tor Connection Assistant knows that it's not the time sync that failed 10.442
And the Tor Connection Assistant knows that there might be a captive portal 0.123
When I open the Unsafe Browser from Tor Connection 14.930
And I log-in to the Captive Portal 10.327
And I close the Unsafe Browser 0.121
And the Tor network and default bridges are unblocked 1.696
And I allow time sync before Tor connects to work again 0.060
And I click "Connect to Tor" 1.149
Then I wait until Tor is ready 7.439
After features/support/hooks.rb:291 0.733
After features/support/hooks.rb:75 0.001
Tags: @product
12.276
Before features/support/hooks.rb:245 0.006
Given I have started Tails from DVD and logged in and the network is connected 11.744
Then the firewall's policy is to drop all IPv4 traffic 0.140
And the firewall is configured to only allow the clearnet and debian-tor users to connect directly to the Internet over IPv4 0.238
And the firewall's NAT rules only redirect traffic for the Unsafe Browser, Tor's TransPort, and DNSPort 0.080
And the firewall is configured to block all external IPv6 traffic 0.072
After features/support/hooks.rb:291 0.687
After features/support/hooks.rb:75 0.000
Tags: @product
40.023
Before features/support/hooks.rb:245 0.006
Given I have started Tails from DVD and logged in and the network is connected 11.443
And I capture all network traffic 0.007
When I successfully start the Unsafe Browser 16.101
And I open the Tails homepage in the Unsafe Browser 11.460
And the Tails homepage loads in the Unsafe Browser 0.587
Then the firewall leak detector has detected leaks 0.423
After features/support/hooks.rb:291 0.833
After features/support/hooks.rb:75 0.094
Tags: @product
12.543
Before features/support/hooks.rb:245 0.007
Given I have started Tails from DVD and logged in and the network is connected 11.554
And I capture all network traffic 0.006
And I disable Tails' firewall 0.222
When I do a TCP DNS lookup of "torproject.org" 0.666
Then the firewall leak detector has detected leaks 0.093
After features/support/hooks.rb:291 0.616
After features/support/hooks.rb:75 0.039
Tags: @product
12.394
Before features/support/hooks.rb:245 0.007
Given I have started Tails from DVD and logged in and the network is connected 11.417
And I capture all network traffic 0.005
And I disable Tails' firewall 0.219
When I do a UDP DNS lookup of "torproject.org" 0.665
Then the firewall leak detector has detected leaks 0.087
After features/support/hooks.rb:291 0.676
After features/support/hooks.rb:75 0.040
Tags: @product
16.027
Before features/support/hooks.rb:245 0.004
Given I have started Tails from DVD and logged in and the network is connected 11.592
And I capture all network traffic 0.006
And I disable Tails' firewall 0.213
When I send some ICMP pings 4.106
Then the firewall leak detector has detected leaks 0.107
After features/support/hooks.rb:291 0.577
After features/support/hooks.rb:75 0.048
12.479
Before features/support/hooks.rb:245 0.004
Before features/support/hooks.rb:442 0.005
Given I have started Tails from DVD and logged in and the network is connected 11.218
When I open an untorified TCP connection to 1.2.3.4 on port 42 1.200
Then the untorified connection fails 0.000
And the untorified connection is logged as dropped by the firewall 0.060
After features/support/hooks.rb:450 0.315
After features/support/hooks.rb:291 0.582
After features/support/hooks.rb:75 0.000
11.382
Before features/support/hooks.rb:245 0.006
Before features/support/hooks.rb:442 0.006
Given I have started Tails from DVD and logged in and the network is connected 11.096
When I open an untorified UDP connection to 1.2.3.4 on port 42 0.230
And the untorified connection is logged as dropped by the firewall 0.056
After features/support/hooks.rb:450 0.339
After features/support/hooks.rb:291 0.603
After features/support/hooks.rb:75 0.000
16.710
Before features/support/hooks.rb:245 0.006
Before features/support/hooks.rb:442 0.006
Given I have started Tails from DVD and logged in and the network is connected 11.363
When I open an untorified ICMP connection to 1.2.3.4 5.267
Then the untorified connection fails 0.000
And the untorified connection is logged as dropped by the firewall 0.080
After features/support/hooks.rb:450 0.347
After features/support/hooks.rb:291 0.616
After features/support/hooks.rb:75 0.000
Tags: @product
19.769
Before features/support/hooks.rb:245 0.007
Given I have started Tails from DVD without network and logged in 8.216
And the system DNS is using the local DNS resolver 0.020
And the network is plugged 0.030
And I successfully configure Tor 11.489
Then the system DNS is still using the local DNS resolver 0.011
After features/support/hooks.rb:291 0.611
After features/support/hooks.rb:75 0.000
10.244
When I monitor the network connections of tails-security-check 0.057
And I re-run tails-security-check 0.122
Then I see that tails-security-check is properly stream isolated after 10 seconds 10.063
After features/support/hooks.rb:450 0.534
After features/support/hooks.rb:291 0.727
After features/support/hooks.rb:75 0.000
2.395
When I monitor the network connections of htpdate 0.062
And I re-run htpdate 2.319
Then I see that htpdate is properly stream isolated 0.013
After features/support/hooks.rb:450 0.464
After features/support/hooks.rb:291 0.576
After features/support/hooks.rb:75 0.000
32.202
When I monitor the network connections of tails-upgrade-frontend-wrapper 0.067
And I re-run tails-upgrade-frontend-wrapper 32.121
Then I see that tails-upgrade-frontend-wrapper is properly stream isolated 0.012
After features/support/hooks.rb:450 0.498
After features/support/hooks.rb:291 0.743
After features/support/hooks.rb:75 0.000
31.124
When I monitor the network connections of Tor Browser 0.062
And I start the Tor Browser 30.135
And the Tor Browser loads the startup page 0.885
Then I see that Tor Browser is properly stream isolated 0.040
After features/support/hooks.rb:450 1.299
After features/support/hooks.rb:291 0.751
After features/support/hooks.rb:75 0.000
Tags: @product
51.595
Before features/support/hooks.rb:245 0.006
Given I have started Tails from DVD and logged in and the network is connected 11.153
And a web server is running on the LAN 1.037
And I capture all network traffic 0.006
When I start the Tor Browser 27.672
And the Tor Browser loads the startup page 1.175
And I open a page on the LAN web server in the Tor Browser 9.039
Then the Tor Browser shows the "Unable to connect" error 1.047
And no traffic was sent to the web server on the LAN 0.462
After features/support/hooks.rb:291 0.816
After features/support/hooks.rb:75 0.038
57.057
Before features/support/hooks.rb:245 0.006
Before features/support/hooks.rb:442 0.006
Given I have started Tails from DVD and logged in and the network is connected 11.152
Then the amnesiac Tor Browser directory exists 0.042
And there is a GNOME bookmark for the amnesiac Tor Browser directory 1.485
And the persistent Tor Browser directory does not exist 0.044
When I start the Tor Browser 27.323
And the Tor Browser loads the startup page 1.028
Then I can save the current page as "index.html" to the default downloads directory 4.908
And I can print the current page as "output.pdf" to the default downloads directory 11.072
After features/support/hooks.rb:450 1.145
After features/support/hooks.rb:291 0.640
After features/support/hooks.rb:75 0.000
52.944
Before features/support/hooks.rb:245 0.006
Before features/support/hooks.rb:442 0.006
Given I have started Tails from DVD and logged in and the network is connected 11.087
When I start the Tor Browser 28.649
Then the Tor Browser loads the startup page 1.086
When I download some file in the Tor Browser 11.846
Then the file is saved to the default Tor Browser download directory 0.274
After features/support/hooks.rb:450 1.917
After features/support/hooks.rb:291 0.643
After features/support/hooks.rb:75 0.000
1:28.747
Before features/support/hooks.rb:245 0.006
Before features/support/hooks.rb:442 0.006
Given I have started Tails from DVD and logged in and the network is connected 11.125
When I start the Tor Browser 28.255
And the Tor Browser loads the startup page 1.007
Then I can listen to an Ogg audio track in Tor Browser 48.357
After features/support/hooks.rb:450 2.487
After features/support/hooks.rb:291 0.867
After features/support/hooks.rb:75 0.000
49.768
Before features/support/hooks.rb:245 0.004
Before features/support/hooks.rb:442 0.006
Given I have started Tails from DVD and logged in and the network is connected 11.198
When I start the Tor Browser 27.832
And the Tor Browser loads the startup page 1.007
Then I can watch a WebM video in Tor Browser 9.730
After features/support/hooks.rb:450 1.400
After features/support/hooks.rb:291 0.844
After features/support/hooks.rb:75 0.000
Tags: @product
1:18.003
Before features/support/hooks.rb:245 0.006
Given I have started Tails from DVD and logged in and the network is connected 10.982
And I copy "/usr/share/synaptic/html/index.html" to "/home/amnesia/Tor Browser/synaptic.html" as user "amnesia" 0.145
And I copy "/usr/share/synaptic/html/index.html" to "/home/amnesia/.gnupg/synaptic.html" as user "amnesia" 0.049
And I copy "/usr/share/synaptic/html/index.html" to "/tmp/synaptic.html" as user "amnesia" 0.063
Then the file "/home/amnesia/.gnupg/synaptic.html" exists 0.047
And the file "/lib/live/mount/overlay/rw/home/amnesia/.gnupg/synaptic.html" exists 0.055
And the file "/live/overlay/rw/home/amnesia/.gnupg/synaptic.html" exists 0.041
And the file "/tmp/synaptic.html" exists 0.033
Given I start monitoring the AppArmor log of "torbrowser_firefox" 0.123
When I start the Tor Browser 27.898
And the Tor Browser loads the startup page 1.096
And I open the address "file:///home/amnesia/Tor Browser/synaptic.html" in the Tor Browser 9.171
Then I see "TorBrowserSynapticManual.png" after at most 5 seconds 0.515
And AppArmor has not denied "torbrowser_firefox" from opening "/home/amnesia/Tor Browser/synaptic.html" 0.085
Given I restart monitoring the AppArmor log of "torbrowser_firefox" 0.140
When I open the address "file:///home/amnesia/.gnupg/synaptic.html" in the Tor Browser 8.216
Then I do not see "TorBrowserSynapticManual.png" after at most 5 seconds 0.503
And AppArmor has denied "torbrowser_firefox" from opening "/home/amnesia/.gnupg/synaptic.html" 0.059
Given I restart monitoring the AppArmor log of "torbrowser_firefox" 0.106
When I open the address "file:///lib/live/mount/overlay/rw/home/amnesia/.gnupg/synaptic.html" in the Tor Browser 5.671
Then I do not see "TorBrowserSynapticManual.png" after at most 5 seconds 0.501
And AppArmor has denied "torbrowser_firefox" from opening "/usr/lib/live/mount/overlay/rw/home/amnesia/.gnupg/synaptic.html" 0.056
Given I restart monitoring the AppArmor log of "torbrowser_firefox" 0.099
When I open the address "file:///live/overlay/rw/home/amnesia/.gnupg/synaptic.html" in the Tor Browser 5.898
Then I do not see "TorBrowserSynapticManual.png" after at most 5 seconds 0.513
# Due to our AppArmor aliases, /live/overlay will be treated
# as /lib/live/mount/overlay.
And AppArmor has denied "torbrowser_firefox" from opening "/usr/lib/live/mount/overlay/rw/home/amnesia/.gnupg/synaptic.html" 0.058
# We do not get any AppArmor log for when access to files in /tmp is denied
# since we explictly override (commit 51c0060) the rules (from the user-tmp
# abstraction) that would otherwise allow it, and we do so with "deny", which
# also specifies "noaudit". We could explicitly specify "audit deny" and
# then have logs, but it could be a problem when we set up desktop
# notifications for AppArmor denials (#9337).
When I open the address "file:///tmp/synaptic.html" in the Tor Browser 5.365
Then I do not see "TorBrowserSynapticManual.png" after at most 5 seconds 0.501
After features/support/hooks.rb:291 0.642
After features/support/hooks.rb:75 0.000
Tags: @product
40.171
Before features/support/hooks.rb:245 0.006
Given I have started Tails from DVD and logged in and the network is connected 11.193
When I start the Tor Browser 27.889
Then the Tor Browser uses all expected TBB shared libraries 1.088
After features/support/hooks.rb:291 0.664
After features/support/hooks.rb:75 0.000
55.314
Before features/support/hooks.rb:245 0.006
Before features/support/hooks.rb:442 0.007
Given I have started Tails from DVD and logged in and the network is connected 11.146
When I start the Tor Browser 27.577
And the Tor Browser loads the startup page 1.141
And I open the Tails homepage in the Tor Browser 9.123
Then the Tor Browser loads the Tails homepage 1.113
When I request a new identity in Tor Browser 3.279
Then the Tor Browser restarts into a fresh session 1.932
After features/support/hooks.rb:450 1.639
After features/support/hooks.rb:291 0.800
After features/support/hooks.rb:75 0.000
Tags: @product
41.767
Before features/support/hooks.rb:245 0.006
Given I have started Tails from DVD and logged in and the network is connected 11.194
When I start the Tor Browser 28.066
And the Tor Browser loads the startup page 1.009
Then Tor Browser's circuit view is working 1.497
After features/support/hooks.rb:291 0.635
After features/support/hooks.rb:75 0.000
Tags: @product
1:0.295
Before features/support/hooks.rb:245 0.006
Given I have started Tails from DVD and logged in and the network is connected 11.094
When I start the Tor Browser 28.690
And the Tor Browser loads the startup page 1.116
When I open the address "https://net.ipcalf.com/" in the Tor Browser 8.854
Then Tor Browser displays a 'ifconfig | grep inet | grep -v inet6 | cut -d" " -f2 | tail -n1' heading on the "Network IP Address via ipcalf.com" page 1.044
When I open the address "https://mozilla.github.io/webrtc-landing/pc_test.html" in the Tor Browser 8.538
Then Tor Browser displays a "RTCPeerConnection is missing!" heading on the "Simple RTCPeerConnection Video Test" page 0.955
After features/support/hooks.rb:291 0.855
After features/support/hooks.rb:75 0.000
Tags: @product
1:41.819
Before features/support/hooks.rb:245 0.006
Given I have started Tails without network from a USB drive with a persistent partition enabled and logged in 11.552
And the network is plugged 0.029
And I successfully configure Tor 16.584
And available upgrades have been checked 0.042
And all notifications have disappeared 3.108
Then the persistent Tor Browser directory exists 0.045
And there is a GNOME bookmark for the persistent Tor Browser directory 1.587
When I start the Tor Browser 28.601
And I open the address "https://tails.net/about" in the Tor Browser 9.246
And "Tails - How Tails works" has loaded in the Tor Browser 1.272
Then I can save the current page as "index.html" to the persistent Tor Browser directory 8.952
And I open the address "file:///home/amnesia/Persistent/Tor Browser/index.html" in the Tor Browser 8.603
Then "Tails - How Tails works" has loaded in the Tor Browser 1.613
And I can print the current page as "output.pdf" to the persistent Tor Browser directory 10.578
After features/support/hooks.rb:291 0.734
After features/support/hooks.rb:75 0.000
Tags: @product
47.358
Before features/support/hooks.rb:245 0.006
Given I have started Tails from DVD without network and logged in 8.309
Then the amnesiac Documents directory exists 0.047
And there is a GNOME bookmark for the amnesiac Documents directory 1.137
Then I start the Tor Browser in offline mode 30.131
And I can save the current page as "index.html" to the Documents GNOME bookmark 7.733
After features/support/hooks.rb:291 0.863
After features/support/hooks.rb:75 0.000
Tags: @product
48.285
Before features/support/hooks.rb:245 0.006
Given I have started Tails from DVD without network and logged in 8.070
Then the amnesiac Downloads directory exists 0.054
And there is a GNOME bookmark for the amnesiac Downloads directory 1.199
Then I start the Tor Browser in offline mode 31.249
And I can save the current page as "index.html" to the Downloads GNOME bookmark 7.711
After features/support/hooks.rb:291 1.080
After features/support/hooks.rb:75 0.000
Tags: @product
52.213
Before features/support/hooks.rb:245 0.004
Given I have started Tails from DVD without network and logged in 8.852
Then the amnesiac Music directory exists 0.054
And there is a GNOME bookmark for the amnesiac Music directory 1.251
Then I start the Tor Browser in offline mode 34.353
And I can save the current page as "index.html" to the Music GNOME bookmark 7.701
After features/support/hooks.rb:291 1.055
After features/support/hooks.rb:75 0.000
Tags: @product
49.474
Before features/support/hooks.rb:245 0.007
Given I have started Tails from DVD without network and logged in 8.180
Then the amnesiac Pictures directory exists 0.051
And there is a GNOME bookmark for the amnesiac Pictures directory 1.277
Then I start the Tor Browser in offline mode 31.957
And I can save the current page as "index.html" to the Pictures GNOME bookmark 8.008
After features/support/hooks.rb:291 0.885
After features/support/hooks.rb:75 0.000
Tags: @product
48.946
Before features/support/hooks.rb:245 0.007
Given I have started Tails from DVD without network and logged in 7.993
Then the amnesiac Videos directory exists 0.049
And there is a GNOME bookmark for the amnesiac Videos directory 1.202
Then I start the Tor Browser in offline mode 31.920
And I can save the current page as "index.html" to the Videos GNOME bookmark 7.780
After features/support/hooks.rb:291 3.329
After features/support/hooks.rb:75 0.000
Tags: @product
4:1.884
Before features/support/hooks.rb:245 0.006
Given I have started Tails without network from a USB drive with a persistent partition enabled and logged in 21.013
And all tps features are active 2.175
And all persistent filesystems have safe access rights 0.203
And all persistence configuration files have safe access rights 0.391
And all persistent directories have safe access rights 2.464
When I start the Tor Browser in offline mode 35.014
And I add a bookmark to eff.org in the Tor Browser 12.149
And I cold reboot the computer 10.066
And the computer reboots Tails 54.159
And I enable persistence 33.183
And I log in to a new session 32.755
And all notifications have disappeared 7.843
And I start the Tor Browser in offline mode 29.266
Then the Tor Browser has a bookmark to eff.org 1.196
After features/support/hooks.rb:291 0.870
After features/support/hooks.rb:75 0.009
14.303
When I clone the Git repository "https://github.com/intrigeri/Dist-Zilla-Plugin-LocaleMsgfmt.git" in GNOME Terminal 14.155
Then the Git repository "Dist-Zilla-Plugin-LocaleMsgfmt" has been cloned successfully 0.147
After features/support/hooks.rb:450 0.435
After features/support/hooks.rb:291 0.662
After features/support/hooks.rb:75 0.000
17.303
Given I have the SSH key pair for a Git repository 0.204
When I clone the Git repository "ssh://gitolite3@lizard.tails.boum.org:3004/myprivatekeyispublic/testing.git" in GNOME Terminal 16.944
Then the Git repository "testing" has been cloned successfully 0.154
After features/support/hooks.rb:450 0.467
After features/support/hooks.rb:291 0.630
After features/support/hooks.rb:75 0.000
0.485
When I wget "https://example.com/" to stdout 0.485
Then the wget command is successful 0.000
And the wget standard output contains "Example Domain" 0.000
After features/support/hooks.rb:450 0.276
After features/support/hooks.rb:291 0.577
After features/support/hooks.rb:75 0.000
4.248
When I wget "some Tails mirror" to stdout with the '--spider --header="Host: dl.amnesia.boum.org"' options 4.248

Resolved dl.amnesia.boum.org to 139.178.88.99

Resolved dl.amnesia.boum.org to 208.80.154.139

Then the wget command is successful 0.000
After features/support/hooks.rb:450 0.660
After features/support/hooks.rb:291 0.601
After features/support/hooks.rb:75 0.000
0.425
When I curl "https://example.com/" to stdout 0.425
Then the curl command is successful 0.000
And the curl standard output contains "Example Domain" 0.000
After features/support/hooks.rb:450 0.309
After features/support/hooks.rb:291 0.587
After features/support/hooks.rb:75 0.000
Feature: Using Totem
Tags: @product
53.402
Given I have started Tails from DVD without network and logged in 8.498
And I plug and mount a USB drive containing sample videos 11.943
And I copy the sample videos to "/home/amnesia" as user "amnesia" 0.104
And the file "/home/amnesia/video.mp4" exists 0.054
Given I start monitoring the AppArmor log of "/usr/bin/totem" 0.140
When I open "/home/amnesia/video.mp4" with Totem 13.709
Then I see "SampleLocalMp4VideoFrame.png" after at most 40 seconds 4.568
And AppArmor has not denied "/usr/bin/totem" from opening "/home/amnesia/video.mp4" 0.367
Given I close Totem 0.162
And I copy the sample videos to "/home/amnesia/.gnupg" as user "amnesia" 0.055
And the file "/home/amnesia/.gnupg/video.mp4" exists 0.057
And I restart monitoring the AppArmor log of "/usr/bin/totem" 0.112
When I try to open "/home/amnesia/.gnupg/video.mp4" with Totem 2.153
Then Totem tells me it is not allowed to open this file 1.293
And AppArmor has denied "/usr/bin/totem" from opening "/home/amnesia/.gnupg/video.mp4" 0.051
Given I close Totem 0.133
And the file "/lib/live/mount/overlay/rw/home/amnesia/.gnupg/video.mp4" exists 0.065
And I restart monitoring the AppArmor log of "/usr/bin/totem" 0.098
When I try to open "/lib/live/mount/overlay/rw/home/amnesia/.gnupg/video.mp4" with Totem 2.145
Then Totem tells me it is not allowed to open this file 0.884
And AppArmor has denied "/usr/bin/totem" from opening "/usr/lib/live/mount/overlay/rw/home/amnesia/.gnupg/video.mp4" 0.070
Given I close Totem 0.124
And the file "/live/overlay/rw/home/amnesia/.gnupg/video.mp4" exists 0.047
And I restart monitoring the AppArmor log of "/usr/bin/totem" 0.121
When I try to open "/live/overlay/rw/home/amnesia/.gnupg/video.mp4" with Totem 2.143
Then Totem tells me it is not allowed to open this file 0.776
# Due to our AppArmor aliases, /live/overlay will be treated
# as /usr/lib/live/mount/overlay.
And AppArmor has denied "/usr/bin/totem" from opening "/usr/lib/live/mount/overlay/rw/home/amnesia/.gnupg/video.mp4" 0.060
Given I close Totem 0.168
And I copy "/home/amnesia/video.mp4" to "/home/amnesia/.purple/otr.private_key" as user "amnesia" 0.052
And the file "/home/amnesia/.purple/otr.private_key" exists 0.065
And I restart monitoring the AppArmor log of "/usr/bin/totem" 0.117
When I try to open "/home/amnesia/.purple/otr.private_key" with Totem 2.130
Then Totem tells me it is not allowed to open this file 0.869
And AppArmor has denied "/usr/bin/totem" from opening "/home/amnesia/.purple/otr.private_key" 0.056
After features/support/hooks.rb:291 0.698
After features/support/hooks.rb:75 0.000
Feature: Using Totem
30.768
Given I have started Tails from DVD and logged in and the network is connected 11.144
Then I can watch a WebM video over HTTPs 19.624
After features/support/hooks.rb:450 0.630
After features/support/hooks.rb:291 1.206
After features/support/hooks.rb:75 0.000
Feature: Using Totem
Tags: @product
46.170
Given I have started Tails without network from a USB drive with a persistent partition enabled and logged in 9.710
And I plug and mount a USB drive containing sample videos 10.667
And I copy the sample videos to "/home/amnesia/Persistent" as user "amnesia" 0.097
When I open "/home/amnesia/Persistent/video.mp4" with Totem 14.954
Then I see "SampleLocalMp4VideoFrame.png" after at most 40 seconds 6.320
Given I close Totem 0.401
And I start monitoring the AppArmor log of "/usr/bin/totem" 0.149
And I copy the sample videos to "/home/amnesia/.gnupg" as user "amnesia" 0.055
When I try to open "/home/amnesia/.gnupg/video.mp4" with Totem 2.147
Then Totem tells me it is not allowed to open this file 1.550
And AppArmor has denied "/usr/bin/totem" from opening "/home/amnesia/.gnupg/video.mp4" 0.115
After features/support/hooks.rb:291 0.787
After features/support/hooks.rb:75 0.000
Tags: @product
35.872
Before features/support/hooks.rb:245 0.007
Given I have started Tails from DVD without network and stopped at Tails Greeter's login screen 10.088
And I disable the Unsafe Browser 3.639
And I log in to a new session 14.473
And the network is plugged 0.037
And all notifications have disappeared 5.146
When I try to start the Unsafe Browser 0.020
Then the Unsafe Browser complains that it is disabled 2.466
After features/support/hooks.rb:291 0.593
After features/support/hooks.rb:75 0.000
Tags: @product
34.872
Before features/support/hooks.rb:245 0.006
Given I have started Tails from DVD and logged in and the network is connected 11.556
And a web server is running on the LAN 1.046
When I successfully start the Unsafe Browser 13.901
And I open a page on the LAN web server in the Unsafe Browser 8.208
Then the Unsafe Browser displays the LAN web server hello message 0.159
After features/support/hooks.rb:291 0.656
After features/support/hooks.rb:75 0.000
Tags: @product @doc
43.204
Before features/support/hooks.rb:245 0.007
Given I have started Tails from DVD and logged in and the network is connected 11.233
When I successfully start the Unsafe Browser 13.834
Then the Unsafe Browser runs as the expected user 0.550
And the Unsafe Browser has a red theme 0.558
And the Unsafe Browser shows a warning as its start page 0.574
And the Unsafe Browser has no add-ons enabled 8.045
And the Unsafe Browser has no bookmarks 7.411
And the Unsafe Browser uses all expected TBB shared libraries 0.996
After features/support/hooks.rb:291 0.646
After features/support/hooks.rb:75 0.000
Tags: @product
36.846
Before features/support/hooks.rb:245 0.007
Given I have started Tails from DVD and logged in and the network is connected 11.111
When I successfully start the Unsafe Browser 13.791
When I open the Tails homepage in the Unsafe Browser 11.058
Then the Tails homepage loads in the Unsafe Browser 0.562
And the Unsafe Browser has sent packets out to the Internet 0.321
After features/support/hooks.rb:291 0.818
After features/support/hooks.rb:75 0.000
27.490
Before features/support/hooks.rb:245 0.006
Given I have started Tails from DVD and logged in and the network is connected 11.010
When I successfully start the Unsafe Browser 13.949
And I close the Unsafe Browser 0.121
Then I see the "Shutting down the Unsafe Browser..." notification after at most 60 seconds 0.894
And the Unsafe Browser chroot is torn down 1.515
After features/support/hooks.rb:291 1.015
After features/support/hooks.rb:75 0.000
38.164
Before features/support/hooks.rb:245 0.007
Given I have started Tails from DVD and logged in and the network is connected 11.007
When I successfully start the Unsafe Browser 14.269
# Wait for whatever facility the GNOME Activities Overview uses to
# learn about which applications are running to "settle". Without
# this sleep, it is confused and it's impossible to start a new
# instance (it will just switch to the one we already started).
And I wait 10 seconds 10.010

Slept for 10 seconds

And I try to start the Unsafe Browser 0.012
Then I see a warning about another instance already running 2.863
After features/support/hooks.rb:291 0.963
After features/support/hooks.rb:75 0.000
Tags: @product
49.272
Before features/support/hooks.rb:245 0.006
Given I have started Tails from DVD and logged in and the network is connected 23.585
When I configure the Unsafe Browser to use a local proxy 0.175
And I successfully start the Unsafe Browser 14.138
And I open the Tails homepage in the Unsafe Browser 10.846
Then I see "BrowserProxyRefused.png" after at most 60 seconds 0.525
After features/support/hooks.rb:291 1.311
After features/support/hooks.rb:75 0.000
2:25.826
Before features/support/hooks.rb:245 0.006
Before features/support/hooks.rb:442 0.007
Given I have started Tails from DVD and logged in and the network is connected 11.099
And I capture all network traffic 0.007
And I configure the Unsafe Browser to check for updates more frequently 0.061
But checking for updates is disabled in the Unsafe Browser's configuration 0.011
When I successfully start the Unsafe Browser 14.055
And I wait 120 seconds 2:0.070

Slept for 120 seconds

Then the Unsafe Browser has not sent packets out to the Internet 0.522
After features/support/hooks.rb:450 0.606
After features/support/hooks.rb:291 0.588
After features/support/hooks.rb:75 0.042
27.565
Before features/support/hooks.rb:245 0.006
Given I have started Tails from DVD and logged in and the network is connected 11.131
And the network is unplugged 0.025
# NetworkManager apparently needs some time to notice that the connection is now off
And I wait 10 seconds 10.005

Slept for 10 seconds

When I start the Unsafe Browser 0.011
Then I am told I cannot start the Unsafe Browser when I am offline 6.392
After features/support/hooks.rb:291 0.826
After features/support/hooks.rb:75 0.000
29.171
When I plug a USB drive containing a basic VeraCrypt volume 6.974
And I cancel the GNOME authentication prompt 1.609
And I unlock and mount this VeraCrypt volume with Unlock VeraCrypt Volumes 15.336
And I open this VeraCrypt volume in GNOME Files 4.450
Then I see the expected contents in this VeraCrypt volume 0.311
When I lock the currently opened VeraCrypt volume 0.368
Then the VeraCrypt volume has been unmounted and locked 0.120
After features/support/hooks.rb:291 0.686
After features/support/hooks.rb:75 0.000
32.568
When I plug a USB drive containing a hidden VeraCrypt volume 10.185
And I cancel the GNOME authentication prompt 1.624
And I unlock and mount this VeraCrypt volume with Unlock VeraCrypt Volumes 15.428
And I open this VeraCrypt volume in GNOME Files 4.167
Then I see the expected contents in this VeraCrypt volume 0.570
When I lock the currently opened VeraCrypt volume 0.349
Then the VeraCrypt volume has been unmounted and locked 0.242
After features/support/hooks.rb:291 0.698
After features/support/hooks.rb:75 0.000
39.601
When I plug and mount a USB drive containing a basic VeraCrypt file container with a PIM 10.801
And I unlock and mount this VeraCrypt file container with Unlock VeraCrypt Volumes 22.527
And I open this VeraCrypt volume in GNOME Files 4.448
Then I see the expected contents in this VeraCrypt volume 0.914
When I lock the currently opened VeraCrypt file container 0.772
Then the VeraCrypt file container has been unmounted and locked 0.136
After features/support/hooks.rb:291 0.670
After features/support/hooks.rb:75 0.000
46.672
When I plug and mount a USB drive containing a hidden VeraCrypt file container 20.556
And I unlock and mount this VeraCrypt file container with Unlock VeraCrypt Volumes 18.912
And I open this VeraCrypt volume in GNOME Files 5.437
Then I see the expected contents in this VeraCrypt volume 1.153
When I lock the currently opened VeraCrypt file container 0.385
Then the VeraCrypt file container has been unmounted and locked 0.226
After features/support/hooks.rb:291 0.728
After features/support/hooks.rb:75 0.017
33.611
When I plug a USB drive containing a basic VeraCrypt volume with a keyfile 6.958
And I cancel the GNOME authentication prompt 1.709
And I unlock and mount this VeraCrypt volume with GNOME Disks 20.227
And I open this VeraCrypt volume in GNOME Files 3.711
Then I see the expected contents in this VeraCrypt volume 0.443
When I lock the currently opened VeraCrypt volume 0.405
Then the VeraCrypt volume has been unmounted and locked 0.156
After features/support/hooks.rb:291 0.758
After features/support/hooks.rb:75 0.000
35.240
When I plug a USB drive containing a hidden VeraCrypt volume 10.206
And I cancel the GNOME authentication prompt 1.763
And I unlock and mount this VeraCrypt volume with GNOME Disks 18.346
And I open this VeraCrypt volume in GNOME Files 3.707
Then I see the expected contents in this VeraCrypt volume 0.497
When I lock the currently opened VeraCrypt volume 0.402
Then the VeraCrypt volume has been unmounted and locked 0.317
After features/support/hooks.rb:291 0.743
After features/support/hooks.rb:75 0.000
1:0.183
When I plug and mount a USB drive containing a basic VeraCrypt file container with a keyfile 17.125
And I unlock and mount this VeraCrypt file container with GNOME Disks 31.388
And I open this VeraCrypt volume in GNOME Files 4.009
Then I see the expected contents in this VeraCrypt volume 6.836
When I lock the currently opened VeraCrypt file container 0.405
Then the VeraCrypt file container has been unmounted and locked 0.417
After features/support/hooks.rb:291 0.720
After features/support/hooks.rb:75 0.014
56.389
When I plug and mount a USB drive containing a hidden VeraCrypt file container 20.482
And I unlock and mount this VeraCrypt file container with GNOME Disks 29.981
And I open this VeraCrypt volume in GNOME Files 4.046
Then I see the expected contents in this VeraCrypt volume 1.023
When I lock the currently opened VeraCrypt file container 0.679
Then the VeraCrypt file container has been unmounted and locked 0.177
After features/support/hooks.rb:291 0.742
After features/support/hooks.rb:75 0.014
45.122
When I plug and mount a USB drive containing a basic VeraCrypt file container with a PIM 11.044
And I unlock and mount this VeraCrypt file container with GNOME Disks 28.245
And I open this VeraCrypt volume in GNOME Files 3.787
Then I see the expected contents in this VeraCrypt volume 1.322
When I lock the currently opened VeraCrypt file container 0.496
Then the VeraCrypt file container has been unmounted and locked 0.225