Project Number Date
test_Tails_ISO_stable 4798 18 Apr 2024, 21:18

Tag Report

Steps Scenarios Features
Tag Passed Failed Skipped Pending Undefined Total Passed Failed Total Duration Status
@product 1479 3 2 0 0 1484 199 3 202 4:7:18.518 Failed
Tags: @product
1:59.473
Before features/support/hooks.rb:259 0.030
Given a computer 0.672
And I temporarily create a 100 MiB disk named "swap" 0.167
And I create a gpt swap partition on disk "swap" 13.850
And I plug SATA drive "swap" 1.068
And I temporarily create a 2 GiB disk named "live_hd" 0.062
And I write the Tails ISO image to disk "live_hd" 19.066
And I plug SATA drive "live_hd" 1.055
When I start Tails with network unplugged and I login 1:23.091
Then a "swap" partition was detected by Tails on drive "swap" 0.101
And drive "live_hd" is detected by Tails 0.169
But Tails has no disk swap enabled 0.091
And drive "live_hd" is not mounted 0.077
After features/support/hooks.rb:305 0.960
After features/support/hooks.rb:89 0.125
Tags: @product
1:31.498
Before features/support/hooks.rb:259 0.004
Given a computer 1.209
And I temporarily create a 100 MiB disk named "fake_TailsData" 0.070
And I create a gpt partition labeled "TailsData" with an ext4 filesystem encrypted with password "asdf" on disk "fake_TailsData" 16.722
And I plug non-removable USB drive "fake_TailsData" 1.081
When I start the computer 1.222
And the computer boots Tails 57.128
Then drive "fake_TailsData" is detected by Tails 0.169
And Tails Greeter has not detected a persistence partition 13.893
After features/support/hooks.rb:305 0.781
After features/support/hooks.rb:89 0.010
Tags: @product
1:38.718
Before features/support/hooks.rb:259 0.002
Given a computer 1.208
And I temporarily create a 100 MiB disk named "fake_TailsData" 0.064
And I create a gpt partition labeled "TailsData" with an ext4 filesystem encrypted with password "asdf" on disk "fake_TailsData" 15.716
And I plug SATA drive "fake_TailsData" 1.058
When I start the computer 0.962
And the computer boots Tails 1:5.795
Then drive "fake_TailsData" is detected by Tails 0.182
And Tails Greeter has not detected a persistence partition 13.730
After features/support/hooks.rb:305 0.847
After features/support/hooks.rb:89 0.008
Tags: @product
1:30.932
Before features/support/hooks.rb:259 0.003
Given a computer 0.159
And I temporarily create a 100 MiB disk named "gpt_ext2" 0.053
And I create a gpt partition with an ext2 filesystem on disk "gpt_ext2" 3.955
And I plug SATA drive "gpt_ext2" 1.050
And I temporarily create a 100 MiB disk named "msdos_fat32" 0.056
And I create an msdos partition with a vfat filesystem on disk "msdos_fat32" 3.960
And I plug SATA drive "msdos_fat32" 1.055
And I start Tails from DVD with network unplugged and I login 1:20.213
Then drive "gpt_ext2" is detected by Tails 0.168
And drive "gpt_ext2" is not mounted 0.095
And drive "msdos_fat32" is detected by Tails 0.101
And drive "msdos_fat32" is not mounted 0.064
After features/support/hooks.rb:305 0.695
After features/support/hooks.rb:89 0.009
Tags: @product
2:3.115
Before features/support/hooks.rb:259 0.002
Given I have started Tails from DVD without network and logged in with an administration password 1:56.409
And running a command as root with pkexec requires PolicyKit administrator privileges 0.104
Then I can run a command as root with sudo 0.144
Then I can run a command as root with pkexec 6.456
After features/support/hooks.rb:305 0.927
After features/support/hooks.rb:89 0.007
Tags: @product
1:27.973
Before features/support/hooks.rb:259 0.002
Given I have started Tails from DVD without network and logged in 42.125
And running a command as root with pkexec requires PolicyKit administrator privileges 0.107
Then I cannot run a command as root with sudo and the standard passwords 0.231
And I cannot run a command as root with pkexec and the standard passwords 20.288
Then I cannot login as root using su with the standard passwords 25.220
After features/support/hooks.rb:305 0.779
After features/support/hooks.rb:89 0.000
Feature: Time syncing
26.301
Before features/support/hooks.rb:259 0.002
Before features/support/hooks.rb:456 0.002
Given I have started Tails from DVD without network and logged in 8.202
When the network is plugged 0.208
And I successfully configure Tor 17.828
Then the system clock is less than 5 minutes incorrect 0.062
After features/support/hooks.rb:464 0.520
After features/support/hooks.rb:305 1.287
After features/support/hooks.rb:89 0.000
Feature: Time syncing
30.488
Before features/support/hooks.rb:259 0.002
Before features/support/hooks.rb:456 0.002
Given I have started Tails from DVD without network and logged in 8.165
When the network is plugged 0.036
And the Tor Connection Assistant autostarts 3.341
And I configure some normal bridges in the Tor Connection Assistant 14.560
And I wait until Tor is ready 4.339
Then the system clock is less than 5 minutes incorrect 0.045
After features/support/hooks.rb:464 0.473
After features/support/hooks.rb:305 0.641
After features/support/hooks.rb:89 0.000
Feature: Time syncing
33.846
Before features/support/hooks.rb:259 0.002
Before features/support/hooks.rb:456 0.002
Given I have started Tails from DVD without network and logged in 8.183
When I bump the system time with "+1 day" 0.247
And I capture all network traffic 0.003
And the network is plugged 0.040
And the Tor Connection Assistant autostarts 4.447
And I configure some obfs4 bridges in the Tor Connection Assistant in easy mode 18.540
And I wait until Tor is ready 1.374
Then the system clock is less than 5 minutes incorrect 0.048
And all Internet traffic has only flowed through the configured bridges or connectivity check service 0.960
After features/support/hooks.rb:464 0.549
After features/support/hooks.rb:305 0.737
After features/support/hooks.rb:89 0.029
Feature: Time syncing
1:21.129
Before features/support/hooks.rb:259 0.003
Before features/support/hooks.rb:456 0.003
Given I have started Tails from DVD without network and logged in 8.311
When I bump the system time with "-15 days" 0.361
And I warm reboot the computer 0.015
And the computer reboots Tails 1:12.321
Then Tails' hardware clock is close to the host system's time 0.120
After features/support/hooks.rb:464 0.128
After features/support/hooks.rb:305 0.712
After features/support/hooks.rb:89 0.006
Feature: Time syncing
1:31.130
Before features/support/hooks.rb:259 0.002
Before features/support/hooks.rb:456 0.003
Given I have started Tails from DVD without network and logged in 8.186
When I bump the hardware clock's time with "-15 days" 1.946
And I warm reboot the computer 0.015
And the computer reboots Tails 1:19.894
Then the hardware clock is still off by "-15 days" 1.086
After features/support/hooks.rb:464 0.106
After features/support/hooks.rb:305 0.867
After features/support/hooks.rb:89 0.007
Feature: Time syncing
57.696
Before features/support/hooks.rb:259 0.002
Before features/support/hooks.rb:456 0.002
Given a computer 0.187
And the hardware clock is set to "01 Jan 2000 12:34:56" 0.030
And I start the computer 1.004
And the computer boots Tails 56.262
Then the system clock is just past Tails' source date 0.211
After features/support/hooks.rb:464 0.110
After features/support/hooks.rb:305 0.685
After features/support/hooks.rb:89 0.012
Feature: Time syncing
1:3.732
Before features/support/hooks.rb:259 0.002
Before features/support/hooks.rb:456 0.002
Given I have started Tails from DVD without network and logged in 9.254
And I make sure time sync before Tor connects times out 1.161
When the network is plugged 0.036
And I successfully configure Tor 53.207
Then the system clock is less than 5 minutes incorrect 0.072
After features/support/hooks.rb:464 0.644
After features/support/hooks.rb:305 0.683
After features/support/hooks.rb:89 0.000
Feature: Time syncing
1:4.600
Before features/support/hooks.rb:259 0.002
Before features/support/hooks.rb:456 0.001
Given I have started Tails from DVD without network and logged in 8.235
When I bump the system time with "+8 hours +15 minutes" 0.285
And all notifications have disappeared 4.000
And I capture all network traffic 0.002
And I make sure time sync before Tor connects fails 0.121
And the network is plugged 0.047
And the Tor Connection Assistant autostarts 3.728
When I configure the default bridges in the Tor Connection Assistant in easy mode without connecting 5.840
And I click "Connect to Tor" 1.149
And the Tor Connection Assistant fails to connect to Tor 16.867
# The "Fix Clock" button allows users to recover from this bug
Then I set the time zone in Tor Connection to "Asia/Shanghai" 14.866
Then the system clock is less than 20 minutes incorrect 0.267
When I click "Connect to Tor" 1.148
Then I wait until Tor is ready 7.136
And all Internet traffic has only flowed through the default bridges or fake connectivity check service 0.849
# check that htpdate has done its job
And the system clock is less than 5 minutes incorrect 0.051
After features/support/hooks.rb:464 0.473
After features/support/hooks.rb:305 0.627
After features/support/hooks.rb:89 0.049
Feature: Time syncing
59.949
Before features/support/hooks.rb:259 0.002
Before features/support/hooks.rb:456 0.001
Given I have started Tails from DVD without network and logged in 8.427
When I bump the system time with "+8 hours +15 minutes" 0.285
And all notifications have disappeared 4.019
And I capture all network traffic 0.004
And the network is plugged 0.051
And the Tor Connection Assistant autostarts 4.452
# Anti-test: Users east of UTC can't connect to obfs4 bridges
And I configure some obfs4 bridges in the Tor Connection Assistant in hide mode without connecting 4.766
And I click "Connect to Tor" 1.230
Then the Tor Connection Assistant reports that it failed to connect 11.826
# The "Fix Clock" button allows users to recover from this bug
When I set the time zone in Tor Connection to "Asia/Shanghai" 14.885
Then the system clock is less than 20 minutes incorrect 0.276
# "Asia/Shanghai" is UTC+08:00 all year long (no DST)
And the displayed clock is less than 20 minutes incorrect in "+08:00" 0.411
When I click "Connect to Tor" 1.153
Then I wait until Tor is ready 6.805
And all Internet traffic has only flowed through the configured bridges 0.944
# check that htpdate has done its job
And the system clock is less than 5 minutes incorrect 0.050
And the displayed clock is less than 5 minutes incorrect in "+08:00" 0.357
After features/support/hooks.rb:464 0.500
After features/support/hooks.rb:305 0.667
After features/support/hooks.rb:89 0.039
Feature: Time syncing
26.791
Before features/support/hooks.rb:259 0.002
Before features/support/hooks.rb:456 0.002
Given I have started Tails from DVD without network and logged in 8.875
And I make sure time sync before Tor connects uses a fake connectivity check service 1.185
And the network is plugged 0.048
And Tor is ready 15.014
Then the fake connectivity check service has received a new HTTP request 0.000
When I make NetworkManager perform a connectivity check 1.663
Then the fake connectivity check service has received a new HTTP request 0.000
And the HTTP requests received by the fake connectivity check service are identical 0.003
After features/support/hooks.rb:464 0.665
After features/support/hooks.rb:305 0.729
After features/support/hooks.rb:89 0.002
Tags: @product
18.753
When I configure some normal bridges in the Tor Connection Assistant 15.286
Then I wait until Tor is ready 2.559
And tca.conf includes the configured bridges 0.012
And available upgrades have been checked 0.058
And all Internet traffic has only flowed through the configured bridges or connectivity check service 0.836
After features/support/hooks.rb:305 0.628
After features/support/hooks.rb:89 0.038
Tags: @product
18.322
When I configure some obfs4 bridges in the Tor Connection Assistant in hide mode 15.571
Then I wait until Tor is ready 1.738
And tca.conf includes the configured bridges 0.011
And available upgrades have been checked 0.051
And all Internet traffic has only flowed through the configured bridges 0.949
After features/support/hooks.rb:305 0.721
After features/support/hooks.rb:89 0.052
Tags: @product
36.678
When I configure some obfs4 bridges from a QR code in the Tor Connection Assistant in hide mode 33.238
Then I wait until Tor is ready 2.399
And tca.conf includes the configured bridges 0.012
And available upgrades have been checked 0.053
And all Internet traffic has only flowed through the configured bridges 0.974
After features/support/hooks.rb:305 0.628
After features/support/hooks.rb:89 0.064
Tags: @product
1:11.146
Given the Tor network and default bridges are blocked 2.278
When I unsuccessfully configure a direct connection in the Tor Connection Assistant 32.563
Then the Tor Connection Assistant reports that it failed to connect 0.111
And tca.conf is empty 0.236
Given I scan a QR code from the error page in Tor Connection Assistant 20.938
And I retry connecting to Tor 1.178
Then I wait until Tor is ready 12.701
And tca.conf includes the configured bridges 0.017
And available upgrades have been checked 0.057
And all Internet traffic has only flowed through the configured bridges or connectivity check service 1.063
After features/support/hooks.rb:305 0.736
After features/support/hooks.rb:89 0.042
21.803
When I configure the default bridges in the Tor Connection Assistant 17.573
Then I wait until Tor is ready 2.111
And Tor is configured to use the default bridges 0.502
And tca.conf includes no bridge 0.014
And available upgrades have been checked 0.066
And Tor is configured to use the default bridges 0.505
And all Internet traffic has only flowed through the default bridges or connectivity check service 1.028
After features/support/hooks.rb:305 0.694
After features/support/hooks.rb:89 0.058
Tags: @product
31.270
Given the Tor network is blocked 2.724
When I configure a direct connection in the Tor Connection Assistant 22.029
Then I wait until Tor is ready 3.699
And tca.conf includes no bridge 0.014
And available upgrades have been checked 1.105
And Tor is configured to use the default bridges 0.540
And all Internet traffic has only flowed through the default bridges or connectivity check service 1.155
After features/support/hooks.rb:305 0.673
After features/support/hooks.rb:89 0.052
Tags: @product
46.175
Given the Tor network and default bridges are blocked 2.822
When I unsuccessfully configure a direct connection in the Tor Connection Assistant 31.332
Then the Tor Connection Assistant reports that it failed to connect 0.120
And tca.conf is empty 0.275
Given the Tor network and default bridges are unblocked 1.242
And I retry connecting to Tor 1.159
Then I wait until Tor is ready 7.278
And tca.conf includes no bridge 0.011
And available upgrades have been checked 0.056
And all Internet traffic has only flowed through Tor or connectivity check service 1.876
After features/support/hooks.rb:305 1.245
After features/support/hooks.rb:89 0.049
Tags: @product
5.478
When I try to configure some normal bridges in the Tor Connection Assistant in hide mode 5.167
Then the Tor Connection Assistant complains that normal bridges are not allowed 0.154
And I cannot click the "Connect to Tor" button 0.156
After features/support/hooks.rb:305 1.553
After features/support/hooks.rb:89 0.057
Tags: @product
29.303
Given I configure a direct connection in the Tor Connection Assistant 10.503
And I wait until Tor is ready 1.868
When I disconnect the network through GNOME 3.054
And I connect the network through GNOME 2.775
Then the Tor Connection Assistant autostarts 2.354
And the Tor Connection Assistant connects to Tor 6.056
And I wait until Tor is ready 1.008
And Tor is using the same configuration as before 0.000
And available upgrades have been checked 0.047
And all Internet traffic has only flowed through Tor or connectivity check service 1.633
After features/support/hooks.rb:305 0.649
After features/support/hooks.rb:89 0.043
Tags: @product
55.923
Given I configure a direct connection in the Tor Connection Assistant 8.820
And I wait until Tor is ready 4.048
And I disconnect the network through GNOME 11.853
And the Tor network and default bridges are blocked 1.961
When I connect the network through GNOME 2.793
Then the Tor Connection Assistant reports that it failed to connect 26.446
After features/support/hooks.rb:305 0.760
After features/support/hooks.rb:89 0.036
Tags: @product
38.686
Given the Tor network and default bridges are blocked 2.464
When I unsuccessfully configure some default bridges in the Tor Connection Assistant 24.375
Then the Tor Connection Assistant reports that it failed to connect 0.133
Given the Tor network and default bridges are unblocked 1.477
When I click "Connect to Tor" 1.174
Then I wait until Tor is ready 7.672
And Tor is configured to use the default bridges 0.491
And all Internet traffic has only flowed through the default bridges or connectivity check service 0.897
After features/support/hooks.rb:305 0.654
After features/support/hooks.rb:89 0.071
18.460
Before features/support/hooks.rb:259 0.002
Given I have started Tails from DVD without network and logged in 8.238
And I prepare Tails for memory erasure tests 0.455
When I start a process allocating 128 MiB of memory with a known pattern 1.333
Then patterns cover at least 128 MiB in the guest's memory 3.711

Pattern coverage: 100.000% (128 MiB out of 128 MiB reference memory)

When I kill the allocating process 0.672
Then I find very few patterns in the guest's memory 4.049

Pattern coverage: 0.000% (0 MiB out of 885 MiB reference memory)

After features/support/hooks.rb:305 0.836
After features/support/hooks.rb:89 0.000
24.633
Before features/support/hooks.rb:259 0.003
Given I have started Tails from DVD without network and logged in 8.357
And I prepare Tails for memory erasure tests 0.426
And I find very few patterns in the guest's memory 4.232

Pattern coverage: 0.000% (0 MiB out of 896 MiB reference memory)

When I mount a 128 MiB tmpfs on "/mnt" and fill it with a known pattern 1.745
Then patterns cover at least 99% of the test FS size in the guest's memory 4.256

Pattern coverage: 100.000% (128 MiB out of 128 MiB reference memory)

When I umount "/mnt" 0.443
Then I find very few patterns in the guest's memory 5.170

Pattern coverage: 0.000% (0 MiB out of 896 MiB reference memory)

After features/support/hooks.rb:305 1.322
After features/support/hooks.rb:89 0.000
43.815
Before features/support/hooks.rb:259 0.003
Given I have started Tails from DVD without network and logged in 8.840
And I prepare Tails for memory erasure tests 0.433
When I plug and mount a 128 MiB USB drive with a vfat filesystem 8.929
Then I find very few patterns in the guest's memory 4.531

Pattern coverage: 0.000% (0 MiB out of 892 MiB reference memory)

# write cache
When I fill the USB drive with a known pattern 2.132
Then patterns cover at least 86% of the test FS size in the guest's memory 4.376

Pattern coverage: 89.187% (113 MiB out of 127 MiB reference memory)

When I umount the USB drive 0.918
Then I find very few patterns in the guest's memory 4.206

Pattern coverage: 0.000% (0 MiB out of 892 MiB reference memory)

# read cache
When I mount the USB drive again 0.263
And I read the content of the test FS 0.394
Then patterns cover at least 99% of the test FS size in the guest's memory 4.044

Pattern coverage: 100.596% (128 MiB out of 127 MiB reference memory)

When I umount the USB drive 0.298
Then I find very few patterns in the guest's memory 4.447

Pattern coverage: 0.000% (0 MiB out of 892 MiB reference memory)

After features/support/hooks.rb:305 2.101
After features/support/hooks.rb:89 0.000
1:3.623
Before features/support/hooks.rb:259 0.002
Given I have started Tails from DVD without network and logged in 8.083
And I prepare Tails for memory erasure tests 0.400
When I plug and mount a 128 MiB USB drive with an ext4 filesystem encrypted with password "asdf" 31.252
Then I find very few patterns in the guest's memory 3.638

Pattern coverage: 0.000% (0 MiB out of 882 MiB reference memory)

# write cache
When I fill the USB drive with a known pattern 1.610
Then patterns cover at least 99% of the test FS size in the guest's memory 2.923

Pattern coverage: 106.113% (97 MiB out of 91 MiB reference memory)

When I umount the USB drive 0.611
Then I find very few patterns in the guest's memory 3.420

Pattern coverage: 0.000% (0 MiB out of 882 MiB reference memory)

# read cache
When I mount the USB drive again 3.512
And I read the content of the test FS 0.365
Then patterns cover at least 99% of the test FS size in the guest's memory 3.327

Pattern coverage: 106.116% (97 MiB out of 91 MiB reference memory)

When I umount the USB drive 0.511
Then I find very few patterns in the guest's memory 3.966

Pattern coverage: 0.000% (0 MiB out of 882 MiB reference memory)

After features/support/hooks.rb:305 0.753
After features/support/hooks.rb:89 0.000
52.780
Before features/support/hooks.rb:259 0.002
Given I have started Tails from DVD without network and logged in 8.016
And I prepare Tails for memory erasure tests 0.391
When I fill a 128 MiB file with a known pattern on the root filesystem 16.135
# ensure the pattern is in memory due to tmpfs, not to disk cache
And I drop all kernel caches 3.710
Then patterns cover at least 128 MiB in the guest's memory 2.768

Pattern coverage: 100.000% (128 MiB out of 128 MiB reference memory)

When I trigger shutdown 0.013
And I wait 20 seconds 20.020

Slept for 20 seconds

Then I find very few patterns in the guest's memory 1.725

Pattern coverage: 0.000% (0 MiB out of 900 MiB reference memory)

After features/support/hooks.rb:305 3.560
After features/support/hooks.rb:89 0.000
7:3.401
Before features/support/hooks.rb:259 0.002
Given I have started Tails without network from a USB drive with a persistent partition enabled and logged in 6:17.831
And I prepare Tails for memory erasure tests 0.433
When I fill a 128 MiB file with a known pattern on the persistent filesystem 22.959
When I trigger shutdown 0.010
And I wait 20 seconds 20.016

Slept for 20 seconds

Then I find very few patterns in the guest's memory 2.150

Pattern coverage: 0.000% (0 MiB out of 904 MiB reference memory)

After features/support/hooks.rb:305 3.528
After features/support/hooks.rb:89 0.009
23.603
Before features/support/hooks.rb:259 0.002
Given I have started Tails from DVD without network and logged in 7.907
And I temporarily create a 4 GiB disk named "gptfat" 0.053
And I create a gpt partition with a vfat filesystem on disk "gptfat" 4.106
And I plug USB drive "gptfat" 2.542
When I start Tails Installer 8.938
Then I am told by Tails Installer that the destination device "is too small" 0.054
After features/support/hooks.rb:305 0.649
After features/support/hooks.rb:89 0.001
Tags: @product
20.221
Before features/support/hooks.rb:259 0.002
Given I have started Tails from DVD without network and logged in 7.978
And I temporarily create a 7200 MiB disk named "temp" 0.066
And I start Tails Installer 9.154
But a suitable USB device is not found 0.018
When I plug USB drive "temp" 2.732
Then the "temp" USB drive is selected 0.078
When I unplug USB drive "temp" 0.172
Then a suitable USB device is not found 0.019
After features/support/hooks.rb:305 0.731
After features/support/hooks.rb:89 0.000
Tags: @product
3:42.353
Before features/support/hooks.rb:259 0.003
Given I have started Tails from DVD without network and logged in 8.646
And I temporarily create a 7200 MiB disk named "install" 0.065
And I create a gpt partition with a vfat filesystem on disk "install" 5.121
And I plug USB drive "install" 2.588
And I install Tails to USB drive "install" by cloning 3:14.862
Then the running Tails is installed on USB drive "install" 11.007
But there is no persistence partition on USB drive "install" 0.061
After features/support/hooks.rb:305 1.264
After features/support/hooks.rb:89 0.116
Tags: @product
3:37.930
Before features/support/hooks.rb:259 0.003
Given I have started Tails from DVD without network and logged in 8.391
And I temporarily create a 7200 MiB disk named "install" 0.056
And I plug USB drive "install" 2.464
And I install Tails to USB drive "install" by cloning 3:16.008
Then the running Tails is installed on USB drive "install" 10.929
But there is no persistence partition on USB drive "install" 0.080
After features/support/hooks.rb:305 1.356
After features/support/hooks.rb:89 0.113
Tags: @product
4:14.220
Before features/support/hooks.rb:259 0.003
Given I have started Tails without network from a USB drive with a persistent partition enabled and logged in 11.642
And I create a file in the Persistent directory 0.251
And I temporarily create a 7200 MiB disk named "install" 0.057
And I create a gpt partition with a vfat filesystem on disk "install" 4.089
And I plug USB drive "install" 2.569
And I install Tails with Persistent Storage to USB drive "install" by cloning 3:39.451
Then the running Tails is installed on USB drive "install" 12.749
And there is a persistence partition on USB drive "install" 0.067
And the USB drive "install" contains the same files as my persistent storage 3.341
After features/support/hooks.rb:305 1.936
After features/support/hooks.rb:89 0.142
Tags: @product
3:46.172
Before features/support/hooks.rb:259 0.003
Given I have started Tails without network from a USB drive with a persistent partition enabled and logged in 11.410
And I temporarily create a 7200 MiB disk named "install" 0.045
And I plug USB drive "install" 2.556
And I install Tails to USB drive "install" by cloning 3:17.277
Then the running Tails is installed on USB drive "install" 14.811
And there is no persistence partition on USB drive "install" 0.070
After features/support/hooks.rb:305 2.980
After features/support/hooks.rb:89 0.094
Tags: @product
3:56.489
Before features/support/hooks.rb:259 0.003
# We reach this first checkpoint only to ensure that the ' __internal' disk has reached the state (Tails installed + persistent partition set up) we need before we clone it below.
# This first part is done without Tails Installer (install from Tails USB image)
# Note: the "__internal" disk will keep its state across scenarios
# and features until one of its snapshots is restored.
Given I have started Tails without network from a USB drive with a persistent partition enabled and logged in 10.254
And I have started Tails from DVD without network and logged in 8.982
And I clone USB drive "__internal" to a temporary USB drive "install" 1.221
And I plug USB drive "install" 3.708
# This second part is done with Tails Installer, that's what this scenario is about
When I reinstall Tails to USB drive "install" by cloning 3:17.413
Then the running Tails is installed on USB drive "install" 14.817
And there is no persistence partition on USB drive "install" 0.090
After features/support/hooks.rb:305 1.476
After features/support/hooks.rb:89 0.140
Tags: @product @uefi
1:51.342
Before features/support/hooks.rb:259 0.002
Given I have started Tails without network from a USB drive without a persistent partition and stopped at Tails Greeter's login screen 11.124
And I power off the computer 0.343
And the computer is set to boot in UEFI mode 0.025
When I start Tails from USB drive "__internal" with network unplugged and I login 1:36.441
Then Tails is running from USB drive "__internal" 0.353
And the boot device has safe access rights 2.998
And Tails has started in UEFI mode 0.056
After features/support/hooks.rb:305 0.622
After features/support/hooks.rb:89 0.006
Tags: @product
1:37.607
Before features/support/hooks.rb:259 0.003
Given I have started Tails from DVD without network and logged in 8.373
And I plug and mount a USB drive containing a Tails USB image 31.608
And I create a 7200 MiB disk named "usbimage" 0.050
And I plug USB drive "usbimage" 2.445
And I install a Tails USB image to the 7200 MiB disk with GNOME Disks 55.129
After features/support/hooks.rb:305 2.392
After features/support/hooks.rb:89 0.113
Tags: @product
1:29.763
Before features/support/hooks.rb:259 0.003
Given a computer 0.198
And I start Tails from USB drive "usbimage" with network unplugged and I login 1:27.870
Then Tails is running from USB drive "usbimage" 0.817
And the label of the system partition on "usbimage" is "Tails" 0.251
And the system partition on "usbimage" is an EFI system partition 0.174
And the FAT filesystem on the system partition on "usbimage" is at least 4000M large 0.143
And the UUID of the FAT filesystem on the system partition on "usbimage" was randomized 0.121
And the label of the FAT filesystem on the system partition on "usbimage" is "TAILS" 0.090
And the system partition on "usbimage" has the expected flags 0.094
After features/support/hooks.rb:305 0.909
After features/support/hooks.rb:89 0.005
4:59.663
Before features/support/hooks.rb:259 0.002
Before features/support/hooks.rb:456 0.002
Given I start Tails from a freshly installed USB drive with an administration password and the network is plugged and I login 55.048
And I update APT using apt 19.217
And I install "popularity-contest" using apt 22.506
Then I am proposed to add the "popularity-contest" package to my Additional Software 9.647
When I create a persistent storage and activate the Additional Software feature 21.443
Then Additional Software is correctly configured for package "popularity-contest" 1.371
When I shutdown Tails and wait for the computer to power off 12.788
And I start Tails from USB drive "__internal" with network unplugged 1:1.589
And I enable persistence 25.215
And I log in to a new session 36.379
And the Additional Software installation service has started 31.511
Then I am notified that the installation succeeded 1.829
And Additional Software is correctly configured for package "popularity-contest" 0.841
And the package "popularity-contest" is installed after Additional Software has been started 0.274
After features/support/hooks.rb:464 37.576
After features/support/hooks.rb:305 1.330
After features/support/hooks.rb:89 0.016
2:31.492
Before features/support/hooks.rb:259 0.007
Before features/support/hooks.rb:456 0.004
Given a computer 0.191
And I start Tails from USB drive "__internal" and I login with an administration password 1:44.108
And I update APT using apt 17.026
When I install "makepp" using apt 25.711
Then the Additional Software dpkg hook has been run for package "makepp" and notices the persistence is locked 4.340
And the package "makepp" is installed 0.113
After features/support/hooks.rb:464 37.431
After features/support/hooks.rb:305 1.114
After features/support/hooks.rb:89 0.014
5:11.062
Before features/support/hooks.rb:259 0.006
Before features/support/hooks.rb:456 0.008
Given a computer 0.228
And I start Tails from USB drive "__internal" and I login with persistence enabled and an administration password 3:17.436
When I uninstall "popularity-contest" using apt 21.852
And I accept removing "popularity-contest" from Additional Software 0.561
Then "popularity-contest" is not in the list of Additional Software 0.746
When I start Synaptic 29.441
And I update APT using Synaptic 22.217
And I install "cowsay" using Synaptic 11.741
And I accept adding "cowsay" to Additional Software 1.023
Then Additional Software is correctly configured for package "cowsay" 0.897
When I uninstall "cowsay" using apt 3.211
And I refuse removing "cowsay" from Additional Software 0.544
Then Additional Software is correctly configured for package "cowsay" 0.803
When I start "Additional Software" via GNOME Activities Overview 10.497
And I remove "cowsay" from the list of Additional Software using Additional Software GUI 4.495
Then "cowsay" is not in the list of Additional Software 1.017
When I install "cowsay" using apt 3.201
And I refuse adding "cowsay" to Additional Software 0.502
Then "cowsay" is not in the list of Additional Software 0.639
After features/support/hooks.rb:464 1.000
After features/support/hooks.rb:305 0.745
After features/support/hooks.rb:89 0.008
11:42.717
Before features/support/hooks.rb:259 0.005
Before features/support/hooks.rb:456 0.006
Given a computer 0.214
And I start Tails from USB drive "__internal" and I login with persistence enabled and an administration password 2:20.425
And I configure APT to prefer an old version of cowsay 0.027
When I install an old version "3.03+dfsg2-1" of the cowsay package using apt 26.822
And I accept adding "cowsay" to Additional Software 6.893
And Additional Software is correctly configured for package "cowsay" 0.816
And I shutdown Tails and wait for the computer to power off 6.318
And I start Tails from USB drive "__internal" with network unplugged 1:0.765
And I enable persistence 12.773
# We need to add back this custom APT source for the Additional Software
# install step, as it was not saved in persistence
And I configure APT to prefer an old version of cowsay 0.025
And I log in to a new session 39.448
And the installed version of package "cowsay" is "3.03+dfsg2-1" after Additional Software has been started 41.143
And I revert the APT tweaks that made it prefer an old version of cowsay 0.064
# We remove the newest package after it has been downloaded and before
# it is installed, so that the upgrade process fails
And I prepare the Additional Software upgrade process to fail 0.066
And the network is plugged 0.051
And Tor is ready 19.120
# Note: the next step races against the appearance of the "The
# upgrade of your additional software failed" notification.
# It should win most of the time, which is good, but there's no
# guarantee it does. If it loses, then it'll remove the notification
# we'll be trying to interact with below ("I can open…")
And all notifications have disappeared 7.113
And available upgrades have been checked 0.098
And I see the "The upgrade of your additional software failed" notification after at most 300 seconds 3.234
And I can open the Additional Software configuration window from the notification 4.341
And I shutdown Tails and wait for the computer to power off 2:8.963
And I start Tails from USB drive "__internal" with network unplugged 59.787
And I enable persistence 13.132
# We need to add back this custom APT source for the Additional Software
# install step, as it was not saved in persistence
And I configure APT to prefer an old version of cowsay 0.022
And I log in to a new session 36.773
And the installed version of package "cowsay" is "3.03+dfsg2-1" after Additional Software has been started 41.523
And I revert the APT tweaks that made it prefer an old version of cowsay 0.093
And the network is plugged 0.035
And Tor is ready 52.315
Then the Additional Software upgrade service has started 0.196
And the installed version of package "cowsay" is newer than "3.03+dfsg2-1" 0.110
After features/support/hooks.rb:464 2.711
After features/support/hooks.rb:305 1.031
After features/support/hooks.rb:89 0.035
2:18.651
Before features/support/hooks.rb:259 0.008
Before features/support/hooks.rb:456 0.008
Given a computer 0.236
And I start Tails from USB drive "__internal" with network unplugged 1:5.547
And I enable persistence 12.824
And I remove the "cowsay" deb files from the APT cache 0.755
# Prevent the "Warning: virtual machine detected!" notification from racing
# with the one we'll be interacting with below.
And I disable the tails-virt-notify-user.service user unit 0.101
And I log in to a new session 37.860
Then I see the "The installation of your additional software failed" notification after at most 300 seconds 14.492
And I can open the Additional Software log file from the notification 6.200
And the package "cowsay" is not installed 0.631
After features/support/hooks.rb:464 0.108
After features/support/hooks.rb:305 1.038
After features/support/hooks.rb:89 0.010
Tags: @product
1:47.579
Before features/support/hooks.rb:259 0.007
Given a computer 0.206
And I create a 7200 MiB disk named "old" 0.058
And I plug USB drive "old" 1.063
And I write an old version of the Tails USB image to disk "old" 23.089
When I start Tails from USB drive "old" with network unplugged 1:19.034
Then the boot device has safe access rights 3.072
And Tails is running from USB drive "old" 0.334
And there is no persistence partition on USB drive "old" 0.063
And process "udev-watchdog" is running 0.130
And udev-watchdog is monitoring the correct device 0.335
And I unplug USB drive "old" 0.190
After features/support/hooks.rb:305 6.841
After features/support/hooks.rb:89 0.010
Tags: @product
2:3.770
Before features/support/hooks.rb:259 0.006
Given a computer 0.196
And I start Tails from USB drive "old" with network unplugged and I login 1:18.003
Then Tails is running from USB drive "old" 0.349
And I create a persistent partition 34.036
And I take note of which tps features are available 1.476
Then a Tails persistence partition exists on USB drive "old" 0.777
And I shutdown Tails and wait for the computer to power off 8.929
After features/support/hooks.rb:305 0.160
After features/support/hooks.rb:89 0.011
Tags: @product
2:32.829
Before features/support/hooks.rb:259 0.006
Given a computer 0.198
And I start Tails from USB drive "old" with network unplugged and I login with persistence enabled 2:3.138
Then Tails is running from USB drive "old" 0.414
And all tps features are active 2.175
When I write some files expected to persist 1.830
# Verify that our baseline for the next scenarios is sane
And all persistent filesystems have safe access rights 0.309
And all persistence configuration files have safe access rights 0.487
And all persistent directories from the old Tails version have safe access rights 2.654
And I take note of which tps features are available 0.487
And I shutdown Tails and wait for the computer to power off 4.770
# XXX: how does guestfs work vs snapshots?
Then only the expected files are present on the persistence partition on USB drive "old" 16.362
After features/support/hooks.rb:305 0.132
After features/support/hooks.rb:89 0.010
Tags: @product
2:25.197
Before features/support/hooks.rb:259 0.007
Given I have started Tails without network from a USB drive without a persistent partition and stopped at Tails Greeter's login screen 10.633
And I log in to a new session 20.263
And I clone USB drive "old" to a new USB drive "to_upgrade" 1.435
And I plug USB drive "to_upgrade" 2.450
When I upgrade Tails to USB drive "to_upgrade" by cloning 1:33.302
Then the running Tails is installed on USB drive "to_upgrade" 16.727
And I unplug USB drive "to_upgrade" 0.203
And I unplug USB drive "__internal" 0.180
After features/support/hooks.rb:305 1.621
After features/support/hooks.rb:89 0.000
Tags: @product
2:13.985
Before features/support/hooks.rb:259 0.005
Given a computer 0.173
And I start Tails from USB drive "to_upgrade" with network unplugged and I login with persistence enabled 2:4.458
Then all tps features from the old Tails version are active 1.746
And Tails is running from USB drive "to_upgrade" 0.328
And the boot device has safe access rights 3.362
And the expected persistent files created with the old Tails version are present in the filesystem 1.438
And all persistent directories from the old Tails version have safe access rights 2.478
After features/support/hooks.rb:305 1.080
After features/support/hooks.rb:89 0.010
6:33.922
Before features/support/hooks.rb:259 0.008
Given I have started Tails without network from a USB drive with a persistent partition enabled and logged in 10.207
And no SquashFS delta is installed 0.141
And Tails is fooled to think that version 6.0~testoverlayfs was initially installed 0.283
And Tails is fooled to think it is running version 6.0~testoverlayfs 0.068
And the file system changes introduced in version 6.2~testoverlayfs are not present 0.272
And the file system changes introduced in version 6.3~testoverlayfs are not present 0.440
When the network is plugged 0.041
And Tor is ready 19.445
Then I am proposed to install an incremental upgrade to version 6.2~testoverlayfs 6.525
And I can successfully install the incremental upgrade to version 6.2~testoverlayfs 10.439
Given I shutdown Tails and wait for the computer to power off 6.739
When I start Tails from USB drive "__internal" with network unplugged and I login with persistence enabled 2:6.051
Then Tails is running version 6.2~testoverlayfs 0.015
And all tps features are active 2.597
And the file system changes introduced in version 6.2~testoverlayfs are present 0.374
And only the 6.2~testoverlayfs SquashFS delta is installed 0.065
# Our IUK sets a release date that can make Tor bootstrapping impossible
Given Tails system time is magically synchronized 0.318
# We'll really install Tails_amd64_6.0~testoverlayfs_to_6.3~testoverlayfs.iuk
# but we need some way to force upgrading a second time in a row
# even if only the initially installed version is considered
And Tails is fooled to think that version 6.1~testoverlayfs was initially installed 0.306
When the network is plugged 0.053
And Tor is ready 18.206
Then I am proposed to install an incremental upgrade to version 6.3~testoverlayfs 6.726
And I can successfully install the incremental upgrade to version 6.3~testoverlayfs 10.500
Given I shutdown Tails and wait for the computer to power off 4.238
When I start Tails from USB drive "__internal" with network unplugged and I login with persistence enabled 2:13.220
Then Tails is running version 6.3~testoverlayfs 0.021
And all tps features are active 2.174
And the file system changes introduced in version 6.3~testoverlayfs are present 0.524
And only the 6.3~testoverlayfs SquashFS delta is installed 0.068
# Regression test for #17425 (i.e. the Upgrader would propose
# upgrading to the version that's already running)
Given Tails system time is magically synchronized 0.300
And Tails is fooled to think that version 6.1~testoverlayfs was initially installed 0.305
When the network is plugged 0.033
And Tor is ready 16.481
Then the Upgrader considers the system as up-to-date 0.345
# Regression test on #8158 (i.e. the IUK's filesystem is not part of the Unsafe Browser's chroot)
And I successfully start the Unsafe Browser 15.297
And the file system changes introduced in version 6.3~testoverlayfs are present in the Unsafe Browser's chroot 1.087
After features/support/hooks.rb:305 0.704
After features/support/hooks.rb:89 0.018
39.003
Before features/support/hooks.rb:259 0.005
Given I have started Tails without network from a USB drive with a persistent partition enabled and logged in 10.792
And Tails is fooled to think that version 6.0~testoverlayfs was initially installed 0.415
And Tails is fooled to think it is running version 6.0~testoverlayfs 0.076
And the signing key used by the Upgrader is outdated 0.492
But a current signing key is available on our website 0.000
When the network is plugged 0.039
And Tor is ready 20.082
Then I am proposed to install an incremental upgrade to version 6.2~testoverlayfs 7.103
After features/support/hooks.rb:305 0.720
After features/support/hooks.rb:89 0.000
58.023
Before features/support/hooks.rb:259 0.008
Given I have started Tails from DVD and logged in and the network is connected 48.579
When I eject the boot medium 0.323
Then Tails eventually shuts down 9.120
After features/support/hooks.rb:305 0.262
After features/support/hooks.rb:89 0.000
42.011
Before features/support/hooks.rb:259 0.006
Given I have started Tails from DVD without network and logged in 8.389
And I prepare Tails for memory erasure tests 0.414
And I fill a 128 MiB file with a known pattern on the root filesystem 18.876
And patterns cover at least 128 MiB in the guest's memory 3.261

Pattern coverage: 100.000% (128 MiB out of 128 MiB reference memory)

When I eject the boot medium 0.276
And I wait for Tails to finish wiping the memory 8.979
Then I find very few patterns in the guest's memory 1.813

Pattern coverage: 0.000% (0 MiB out of 902 MiB reference memory)

After features/support/hooks.rb:305 3.608
After features/support/hooks.rb:89 0.000
37.006
Before features/support/hooks.rb:259 0.008
Given I have started Tails from DVD without network and logged in 8.622
And I prepare Tails for memory erasure tests 0.516
And I plug and mount a 128 MiB USB drive with a vfat filesystem 9.010
And I fill the USB drive with a known pattern 2.860
And I read the content of the test FS 0.115
And patterns cover at least 90% of the test FS size in the guest's memory 3.382

Pattern coverage: 100.000% (127 MiB out of 127 MiB reference memory)

When I eject the boot medium 0.937
And I wait for Tails to finish wiping the memory 9.836
Then I find very few patterns in the guest's memory 1.724

Pattern coverage: 0.000% (0 MiB out of 897 MiB reference memory)

After features/support/hooks.rb:305 3.574
After features/support/hooks.rb:89 0.000
54.205
Before features/support/hooks.rb:259 0.006
Given I have started Tails from DVD without network and logged in 8.452
And I prepare Tails for memory erasure tests 0.415
And I plug and mount a 128 MiB USB drive with an ext4 filesystem encrypted with password "asdf" 30.417
And I fill the USB drive with a known pattern 1.383
And I read the content of the test FS 0.060
And patterns cover at least 99% of the test FS size in the guest's memory 3.005

Pattern coverage: 106.113% (97 MiB out of 91 MiB reference memory)

When I eject the boot medium 0.285
And I wait for Tails to finish wiping the memory 8.391
Then I find very few patterns in the guest's memory 1.792

Pattern coverage: 0.000% (0 MiB out of 878 MiB reference memory)

After features/support/hooks.rb:305 3.593
After features/support/hooks.rb:89 0.000
2:21.818
Before features/support/hooks.rb:259 0.007
Given I have started Tails without network from a USB drive with a persistent partition enabled and logged in 9.852
And I prepare Tails for memory erasure tests 0.433
And I fill a 128 MiB file with a known pattern on the persistent filesystem 25.088
And patterns cover at least 100 MiB in the guest's memory 3.505

Pattern coverage: 114.344% (114 MiB out of 100 MiB reference memory)

When I eject the boot medium 0.625
And I wait for Tails to finish wiping the memory 10.096
Then I find very few patterns in the guest's memory 2.478

Pattern coverage: 0.000% (0 MiB out of 893 MiB reference memory)

And Tails eventually shuts down 1:29.737
After features/support/hooks.rb:305 0.170
After features/support/hooks.rb:89 0.000
Tags: @product
59.584
Before features/support/hooks.rb:259 0.006
Given a computer 0.202
And I start Tails from DVD with network unplugged and genuine APT sources 59.074
Then the only hosts in APT sources are "cdn-fastly.deb.debian.org,umjqavufhoix3smyq6az2sx4istmuvsgmz4bq5u5x56rnayejoo6l2qd.onion,apow7mjfryruh65chtdydfmqfpj5btws7nbocgtaovhvezgccyjazpqd.onion" 0.048
And no proposed-updates APT suite is enabled 0.072
And no experimental APT suite is enabled for deb.torproject.org 0.053
And if releasing, no unversioned Tails APT source is enabled 0.112

Not on a tag ⇒ skipping this step

And if releasing, the tagged Tails APT source is enabled 0.020

Not on a tag ⇒ skipping this step

After features/support/hooks.rb:305 0.680
After features/support/hooks.rb:89 0.012
Tags: @product
1:23.226
Before features/support/hooks.rb:259 0.006
Given I have started Tails without network from a USB drive with a persistent partition enabled and logged in 11.658
# The volume cannot be in use when GuestFs clones it, which we do below
And I shutdown Tails and wait for the computer to power off 10.994
And I clone USB drive "__internal" to a temporary USB drive "backup" 1.248
Given I have started Tails without network from a USB drive with a persistent partition enabled and logged in 9.752
And I write a file "/live/persistence/TailsData_unlocked/new" with contents "foo" 0.022
When I start Tails' custom backup tool 3.965
Then the backup tool displays "Plug in your backup Tails USB stick" 0.302
When I plug USB drive "backup" 2.480
And I give the Persistent Storage on drive "backup" its own UUID 0.118
And I click "Retry" in the backup tool 1.153
Then the backup tool displays "Do you want to back up your Persistent Storage now?" 0.191
When I click "Back Up" in the backup tool 1.122
And I enter my persistent storage passphrase into the polkit prompt 7.283
Then the backup tool displays "Your Persistent Storage was backed up successfully to your backup Tails USB stick!" 22.542
# The backup tool ejects the drive, so we have to replug it
When I unplug USB drive "backup" 0.195
And I plug USB drive "backup" 3.416
Then the USB drive "backup" contains the same files as my persistent storage 6.775
After features/support/hooks.rb:305 2.669
After features/support/hooks.rb:89 0.133
Tags: @product
0.207
Then the hostname should not have been leaked on the network 0.207
After features/support/hooks.rb:305 0.668
After features/support/hooks.rb:89 0.045
Tags: @product
0.784
When I add a wired DHCP NetworkManager connection called "manually-added-con" 0.212
And I switch to the "manually-added-con" NetworkManager connection 0.357
Then the hostname should not have been leaked on the network 0.214
After features/support/hooks.rb:305 0.685
After features/support/hooks.rb:89 0.057
42.461
Before features/support/hooks.rb:259 0.009
Given I have started Tails from DVD without network and logged in 8.887
When I start "Tails Documentation" via GNOME Activities Overview 10.974
Then the Tor Browser has started 21.901
Then "Tails - Documentation" has loaded in the Tor Browser 0.696
After features/support/hooks.rb:305 0.880
After features/support/hooks.rb:89 0.000
48.311
Before features/support/hooks.rb:259 0.008
Given I have started Tails from DVD and logged in and the network is connected 13.798
When I start "Tails Documentation" via GNOME Activities Overview 11.081
Then the Tor Browser has started 22.885
Then "Tails - Documentation" has loaded in the Tor Browser 0.545
After features/support/hooks.rb:305 0.950
After features/support/hooks.rb:89 0.000
22.834
Before features/support/hooks.rb:259 0.007
Before features/support/hooks.rb:456 0.006
Given I have started Tails from DVD without network and logged in 9.550
When I start Electrum through the GNOME menu 11.068
But the "electrum" tps feature is not enabled 0.697
And I see a warning that Electrum is not persistent 1.517
After features/support/hooks.rb:464 0.129
After features/support/hooks.rb:305 1.794
After features/support/hooks.rb:89 0.000
Feature: Using Evince
Tags: @product
20.812
Before features/support/hooks.rb:259 0.007
Given I have started Tails from DVD without network and logged in 8.299
When I open "/usr/share/cups/data/default-testpage.pdf" with Evince 3.399
Then I see "CupsTestPage.png" after at most 40 seconds 3.995
And I can print the current document to "/home/amnesia/output.pdf" 5.116
After features/support/hooks.rb:305 0.776
After features/support/hooks.rb:89 0.000
Feature: Using Evince
Tags: @product
20.337
Before features/support/hooks.rb:259 0.006
Given I have started Tails from DVD without network and logged in 8.539
And I copy "/usr/share/cups/data/default-testpage.pdf" to "/home/amnesia" as user "amnesia" 0.167
When I open "/home/amnesia/default-testpage.pdf" with Evince 3.319
Then I see "CupsTestPage.png" after at most 40 seconds 3.159
And I can print the current document to "/home/amnesia/output.pdf" 5.151
After features/support/hooks.rb:305 0.748
After features/support/hooks.rb:89 0.000
Feature: Using Evince
23.746
Before features/support/hooks.rb:259 0.007
Given I have started Tails from DVD without network and logged in 8.628
And I copy "/usr/share/cups/data/default-testpage.pdf" to "/home/amnesia/.gnupg" as user "amnesia" 0.185
Then the file "/home/amnesia/.gnupg/default-testpage.pdf" exists 0.061
And the file "/lib/live/mount/overlay/rw/home/amnesia/.gnupg/default-testpage.pdf" exists after at most 10 seconds 0.071
And the file "/live/overlay/rw/home/amnesia/.gnupg/default-testpage.pdf" exists after at most 10 seconds 0.062
Given I start monitoring the AppArmor log of "/usr/bin/evince" 0.162
When I try to open "/home/amnesia/.gnupg/default-testpage.pdf" with Evince 4.374
Then Evince tells me it cannot open "/home/amnesia/.gnupg/default-testpage.pdf" 2.793
And AppArmor has denied "/usr/bin/evince" from opening "/home/amnesia/.gnupg/default-testpage.pdf" 0.441
When I close Evince 0.205
Given I restart monitoring the AppArmor log of "/usr/bin/evince" 0.155
When I try to open "/lib/live/mount/overlay/rw/home/amnesia/.gnupg/default-testpage.pdf" with Evince 2.216
Then Evince tells me it cannot open "/lib/live/mount/overlay/rw/home/amnesia/.gnupg/default-testpage.pdf" 0.892
And AppArmor has denied "/usr/bin/evince" from opening "/usr/lib/live/mount/overlay/rw/home/amnesia/.gnupg/default-testpage.pdf" 0.057
When I close Evince 0.218
Given I restart monitoring the AppArmor log of "/usr/bin/evince" 0.134
When I try to open "/live/overlay/rw/home/amnesia/.gnupg/default-testpage.pdf" with Evince 2.202
Then Evince tells me it cannot open "/live/overlay/rw/home/amnesia/.gnupg/default-testpage.pdf" 0.824
# Due to our AppArmor aliases, /live/overlay will be treated
# as /usr/lib/live/mount/overlay.
And AppArmor has denied "/usr/bin/evince" from opening "/usr/lib/live/mount/overlay/rw/home/amnesia/.gnupg/default-testpage.pdf" 0.057
After features/support/hooks.rb:305 0.786
After features/support/hooks.rb:89 0.000
Feature: Using Evince
Tags: @product
24.952
Before features/support/hooks.rb:259 0.009
Given I have started Tails without network from a USB drive with a persistent partition enabled and logged in 11.725
And I copy "/usr/share/cups/data/default-testpage.pdf" to "/home/amnesia/Persistent" as user "amnesia" 0.199
Then the file "/home/amnesia/Persistent/default-testpage.pdf" exists 0.084
When I open "/home/amnesia/Persistent/default-testpage.pdf" with Evince 4.184
Then I see "CupsTestPage.png" after at most 40 seconds 3.675
And I can print the current document to "/home/amnesia/Persistent/output.pdf" 5.083
After features/support/hooks.rb:305 0.895
After features/support/hooks.rb:89 0.000
Feature: Using Evince
16.127
Before features/support/hooks.rb:259 0.007
Given I have started Tails without network from a USB drive with a persistent partition enabled and logged in 9.891
And I copy "/usr/share/cups/data/default-testpage.pdf" to "/home/amnesia/.gnupg" as user "amnesia" 0.209
Then the file "/home/amnesia/.gnupg/default-testpage.pdf" exists 0.087
Given I start monitoring the AppArmor log of "/usr/bin/evince" 0.213
And I try to open "/home/amnesia/.gnupg/default-testpage.pdf" with Evince 3.695
Then Evince tells me it cannot open "/home/amnesia/.gnupg/default-testpage.pdf" 1.847
And AppArmor has denied "/usr/bin/evince" from opening "/home/amnesia/.gnupg/default-testpage.pdf" 0.183
After features/support/hooks.rb:305 1.063
After features/support/hooks.rb:89 0.000
20.665
Before features/support/hooks.rb:259 0.008
Given I have started Tails from DVD without network and logged in 9.048
And I wait 10 seconds 10.000

Slept for 10 seconds

And there is no screenshot in the live user's Pictures directory 0.065
When I press the "PRINTSCREEN" key 0.121
And GNOME offers me various screenshot options 1.240
And I press the "Return" key 0.121
Then a screenshot is saved to the live user's Pictures directory 0.067
After features/support/hooks.rb:305 0.811
After features/support/hooks.rb:89 0.000
Tags: @product
9.602
Before features/support/hooks.rb:259 0.007
Given I have started Tails from DVD without network and logged in 8.646
When the "Dogtail rules!" notification is sent 0.248
Then the "Dogtail rules!" notification is shown to the user 0.706
After features/support/hooks.rb:305 0.812
After features/support/hooks.rb:89 0.000
Tags: @product
3:40.384
Before features/support/hooks.rb:259 0.015
# Some apps (Electrum and Persistent Storage Backup) only start when
# a Persistent Storage is available.
Given I have started Tails without network from a USB drive with a persistent partition enabled and logged in 10.152
# Some apps (Tor Browser) only start when the network is plugged.
And the network is plugged 0.044
And Tor is ready 20.416
And all notifications have disappeared 4.168
When I start "Additional Software" via GNOME Activities Overview 11.476
And I close the "tails-additional-software-config" window 2.157
When I start "Disks" via GNOME Activities Overview 9.054
# The close button of GNOME Disks is not accessible
And I close the "gnome-disks" window via Alt+F4 2.692
When I start "GNOME Terminal" via GNOME Activities Overview 8.887
And I close the "gnome-terminal-server" window 2.171
When I start "Files" via GNOME Activities Overview 8.250
And I close the "org.gnome.Nautilus" window 17.098
When I start "Persistent Storage" via GNOME Activities Overview 10.825
And I close the "tps-frontend" window 3.677
When I start "Persistent Storage Backup" via GNOME Activities Overview 10.765
And I close the "zenity" window 4.491
When I start "Pidgin" via GNOME Activities Overview 8.330
And I close the "Pidgin" window via Alt+F4 3.834
When I start "Thunderbird" via GNOME Activities Overview 9.041
And I close the "Thunderbird" window 14.189
When I start "Tor Browser" via GNOME Activities Overview 8.949
And I close the "Firefox" window 13.343
When I start "Unlock VeraCrypt Volumes" via GNOME Activities Overview 11.126
And I close the "unlock-veracrypt-volumes" window 2.475
When I start "Unsafe Browser" via GNOME Activities Overview 9.372
And I close the "Firefox" window 13.389
After features/support/hooks.rb:305 1.808
After features/support/hooks.rb:89 0.000
Tags: @product
41.435
Before features/support/hooks.rb:259 0.006
Given a computer 0.208
And I start the computer from DVD with network unplugged 38.098
When Tails detects disk read failures on the SquashFS 0.588
Then I see a disk failure message on the splash screen 2.539
After features/support/hooks.rb:305 0.677
After features/support/hooks.rb:89 0.012
Tags: @product
39.552
Before features/support/hooks.rb:259 0.007
Given a computer 0.195
And I start the computer from DVD with network unplugged 35.185
When Tails detects disk read failures on the boot device 1.488
Then I see a disk failure message on the splash screen 2.682
After features/support/hooks.rb:305 0.692
After features/support/hooks.rb:89 0.011
Tags: @product
39.342
Before features/support/hooks.rb:259 0.007
Given a computer 0.186
And I start the computer from DVD with network unplugged 35.083
When Tails detects disk read failures on the boot device with a target error 1.478
Then I see a disk failure message on the splash screen 2.594
After features/support/hooks.rb:305 0.665
After features/support/hooks.rb:89 0.011
Tags: @product @doc
34.720
Before features/support/hooks.rb:259 0.007
Given a computer 0.190
And I have started Tails without network from a USB drive with a persistent partition enabled and logged in 9.888
When Tails detects disk read failures on the SquashFS 1.540
Then I see a disk failure message 0.516
Then I can open the hardware failure documentation from the disk failure message 22.583
After features/support/hooks.rb:305 1.687
After features/support/hooks.rb:89 0.000
Tags: @product @doc
33.598
Before features/support/hooks.rb:259 0.005
Given a computer 0.183
And I have started Tails without network from a USB drive with a persistent partition enabled and logged in 9.677
When Tails detects disk read failures on the boot device 1.624
Then I see a disk failure message 0.519
Then I can open the hardware failure documentation from the disk failure message 21.594
After features/support/hooks.rb:305 2.242
After features/support/hooks.rb:89 0.000
Tags: @product @doc
32.995
Before features/support/hooks.rb:259 0.006
Given a computer 0.192
And I have started Tails without network from a USB drive with a persistent partition enabled and logged in 9.721
When Tails detects disk read failures on the boot device with a target error 0.575
Then I see a disk failure message 1.324
Then I can open the hardware failure documentation from the disk failure message 21.181
After features/support/hooks.rb:305 1.822
After features/support/hooks.rb:89 0.000
Feature: Hardware support
Tags: @product
50.966
Before features/support/hooks.rb:259 0.005
Given a computer 0.197
And I start the computer from DVD with network unplugged and an unsupported graphics card 35.827
Then I see a graphics card failure message on the splash screen 14.941
After features/support/hooks.rb:305 0.711
After features/support/hooks.rb:89 0.009
Tags: @product @doc
10.317
Before features/support/hooks.rb:259 0.006
Given I have started Tails from DVD without network and logged in 8.153
Then the included OpenPGP keys are valid for the next 1 month 2.163
After features/support/hooks.rb:305 0.686
After features/support/hooks.rb:89 0.000
Tags: @product
21.101
Scenario The included APT repository keys are up-to-date
Before features/support/hooks.rb:259 0.006
Steps
Given I have started Tails from DVD without network and logged in 8.056
Then the keys trusted by APT are valid for the next 3 months 13.045
The
The following APT key(s) will not be valid in 3 months: A3C4F0F979CAA22CDBA8F512EE8CBC9E886DDD89, 2265EB4CB2BF88D900AE8D1B74A941BA219EC810.
<false> is not true. (Test::Unit::AssertionFailedError)
./features/step_definitions/checks.rb:29:in `assert_all_keys_are_valid_for_n_months'
./features/step_definitions/checks.rb:8:in `/^the keys trusted by APT are valid for the next (\d+) months$/'
features/keys.feature:11:in `Then the keys trusted by APT are valid for the next 3 months'
After features/support/hooks.rb:305 4.448

SCENARIO FAILED: 'The included APT repository keys are up-to-date' (at time 02:13:29)

Screenshot: https://jenkins.tails.boum.org/job/test_Tails_ISO_stable/4798/artifact/build-artifacts/02:13:29_The_included_APT_repository_keys_are_up-to-date.png

Video: https://jenkins.tails.boum.org/job/test_Tails_ISO_stable/4798/artifact/build-artifacts/02:13:29_The_included_APT_repository_keys_are_up-to-date.mkv

Boot log: https://jenkins.tails.boum.org/job/test_Tails_ISO_stable/4798/artifact/build-artifacts/02:13:29_The_included_APT_repository_keys_are_up-to-date.boot-log

Systemd journal: https://jenkins.tails.boum.org/job/test_Tails_ISO_stable/4798/artifact/build-artifacts/02:13:29_The_included_APT_repository_keys_are_up-to-date.journal

After features/support/hooks.rb:89 0.000
Feature: Localization
Tags: @product
53.440
Before features/support/hooks.rb:259 0.006
Given I have started Tails from DVD without network and stopped at Tails Greeter's login screen 18.620
And I log in to a new session in German (de) 31.287
Then the amnesiac Documents directory exists 0.108
And there is a GNOME bookmark for the amnesiac Documents directory 3.424
After features/support/hooks.rb:305 0.672
After features/support/hooks.rb:89 0.000
Feature: Localization
Tags: @product
44.485
Before features/support/hooks.rb:259 0.006
Given I have started Tails from DVD without network and stopped at Tails Greeter's login screen 9.682
And I log in to a new session in German (de) 30.825
Then the amnesiac Downloads directory exists 0.252
And there is a GNOME bookmark for the amnesiac Downloads directory 3.724
After features/support/hooks.rb:305 1.106
After features/support/hooks.rb:89 0.000
Feature: Localization
Tags: @product
42.005
Before features/support/hooks.rb:259 0.006
Given I have started Tails from DVD without network and stopped at Tails Greeter's login screen 8.089
And I log in to a new session in German (de) 30.842
Then the amnesiac Music directory exists 0.211
And there is a GNOME bookmark for the amnesiac Music directory 2.862
After features/support/hooks.rb:305 0.744
After features/support/hooks.rb:89 0.000
Feature: Localization
Tags: @product
42.279
Before features/support/hooks.rb:259 0.007
Given I have started Tails from DVD without network and stopped at Tails Greeter's login screen 8.211
And I log in to a new session in German (de) 30.250
Then the amnesiac Pictures directory exists 0.120
And there is a GNOME bookmark for the amnesiac Pictures directory 3.697
After features/support/hooks.rb:305 1.638
After features/support/hooks.rb:89 0.000
Feature: Localization
Tags: @product
44.228
Before features/support/hooks.rb:259 0.007
Given I have started Tails from DVD without network and stopped at Tails Greeter's login screen 9.685
And I log in to a new session in German (de) 30.808
Then the amnesiac Videos directory exists 0.070
And there is a GNOME bookmark for the amnesiac Videos directory 3.663
After features/support/hooks.rb:305 0.755
After features/support/hooks.rb:89 0.000
Feature: Localization
2:17.837
Before features/support/hooks.rb:259 0.007
Given I have started Tails from DVD without network and stopped at Tails Greeter's login screen 9.007
When I log in to a new session in Arabic (ar) 29.955
Then the keyboard layout is set to "us" 0.237
When the network is plugged 0.236
And Tor is ready 17.208
Then I successfully start the Unsafe Browser in "ar" 16.522
And I kill the Unsafe Browser 5.716
When I enable the screen keyboard 0.096
Then the screen keyboard works in Tor Browser 29.704
And DuckDuckGo is the default search engine 10.404
And I kill the Tor Browser 5.494
And the screen keyboard works in Thunderbird 12.689
And the layout of the screen keyboard is set to "us" 0.564
After features/support/hooks.rb:305 1.692
After features/support/hooks.rb:89 0.000
Feature: Localization
2:21.520
Before features/support/hooks.rb:259 0.008
Given I have started Tails from DVD without network and stopped at Tails Greeter's login screen 8.305
When I log in to a new session in Chinese (zh_CN) 30.210
Then the keyboard layout is set to "cn" 0.457
When the network is plugged 0.064
And Tor is ready 17.694
Then I successfully start the Unsafe Browser in "zh_CN" 18.676
And I kill the Unsafe Browser 5.792
When I enable the screen keyboard 0.090
Then the screen keyboard works in Tor Browser 27.314
And DuckDuckGo is the default search engine 10.365
And I kill the Tor Browser 5.500
And the screen keyboard works in Thunderbird 16.447
And the layout of the screen keyboard is set to "us" 0.600
After features/support/hooks.rb:305 1.577
After features/support/hooks.rb:89 0.000
Feature: Localization
1:50.856
Before features/support/hooks.rb:259 0.006
Given I have started Tails from DVD without network and stopped at Tails Greeter's login screen 7.911
When I log in to a new session in English (en) 15.888
Then the keyboard layout is set to "us" 0.168
When the network is plugged 0.041
And Tor is ready 16.184
Then I successfully start the Unsafe Browser in "en" 15.772
And I kill the Unsafe Browser 5.716
When I enable the screen keyboard 0.082
Then the screen keyboard works in Tor Browser 25.760
And DuckDuckGo is the default search engine 5.149
And I kill the Tor Browser 5.221
And the screen keyboard works in Thunderbird 12.414
And the layout of the screen keyboard is set to "us" 0.544
After features/support/hooks.rb:305 1.031
After features/support/hooks.rb:89 0.000
Feature: Localization
2:51.795
Before features/support/hooks.rb:259 0.006
Given I have started Tails from DVD without network and stopped at Tails Greeter's login screen 10.664
When I log in to a new session in French (fr) 30.815
Then the keyboard layout is set to "fr" 0.332
When the network is plugged 0.036
And Tor is ready 45.790
Then I successfully start the Unsafe Browser in "fr" 14.965
And I kill the Unsafe Browser 5.761
When I enable the screen keyboard 0.096
Then the screen keyboard works in Tor Browser 27.233
And DuckDuckGo is the default search engine 17.339
And I kill the Tor Browser 5.439
And the screen keyboard works in Thunderbird 12.726
And the layout of the screen keyboard is set to "fr" 0.593
After features/support/hooks.rb:305 1.109
After features/support/hooks.rb:89 0.000
Feature: Localization
2:22.144
Before features/support/hooks.rb:259 0.006
Given I have started Tails from DVD without network and stopped at Tails Greeter's login screen 7.802
When I log in to a new session in German (de) 35.017
Then the keyboard layout is set to "de" 0.160
When the network is plugged 0.047
And Tor is ready 17.897
Then I successfully start the Unsafe Browser in "de" 16.318
And I kill the Unsafe Browser 5.743
When I enable the screen keyboard 0.098
Then the screen keyboard works in Tor Browser 27.982
And DuckDuckGo is the default search engine 10.654
And I kill the Tor Browser 5.434
And the screen keyboard works in Thunderbird 14.444
And the layout of the screen keyboard is set to "de" 0.541
After features/support/hooks.rb:305 1.119
After features/support/hooks.rb:89 0.000
Feature: Localization
2:17.018
Before features/support/hooks.rb:259 0.005
Given I have started Tails from DVD without network and stopped at Tails Greeter's login screen 7.983
When I log in to a new session in Italian (it) 30.232
Then the keyboard layout is set to "it" 0.151
When the network is plugged 0.086
And Tor is ready 18.089
Then I successfully start the Unsafe Browser in "it" 16.101
And I kill the Unsafe Browser 5.805
When I enable the screen keyboard 0.097
Then the screen keyboard works in Tor Browser 28.917
And DuckDuckGo is the default search engine 10.275
And I kill the Tor Browser 5.510
And the screen keyboard works in Thunderbird 13.142
And the layout of the screen keyboard is set to "us" 0.622
After features/support/hooks.rb:305 1.323
After features/support/hooks.rb:89 0.000
Feature: Localization
2:47.021
Before features/support/hooks.rb:259 0.006
Given I have started Tails from DVD without network and stopped at Tails Greeter's login screen 8.190
When I log in to a new session in Persian (fa) 33.074
Then the keyboard layout is set to "ir" 0.258
When the network is plugged 0.040
And Tor is ready 45.223
Then I successfully start the Unsafe Browser in "fa" 15.470
And I kill the Unsafe Browser 5.754
When I enable the screen keyboard 0.103
Then the screen keyboard works in Tor Browser 28.288
And DuckDuckGo is the default search engine 10.962
And I kill the Tor Browser 5.479
And the screen keyboard works in Thunderbird 13.588
And the layout of the screen keyboard is set to "ir" 0.588
After features/support/hooks.rb:305 1.532
After features/support/hooks.rb:89 0.000
Feature: Localization
2:22.182
Before features/support/hooks.rb:259 0.007
Given I have started Tails from DVD without network and stopped at Tails Greeter's login screen 8.351
When I log in to a new session in Portuguese (pt) 32.640
Then the keyboard layout is set to "pt" 0.217
When the network is plugged 0.053
And Tor is ready 18.043
Then I successfully start the Unsafe Browser in "pt" 17.382
And I kill the Unsafe Browser 5.778
When I enable the screen keyboard 0.108
Then the screen keyboard works in Tor Browser 27.656
And DuckDuckGo is the default search engine 10.755
And I kill the Tor Browser 5.525
And the screen keyboard works in Thunderbird 14.951
And the layout of the screen keyboard is set to "us" 0.718
After features/support/hooks.rb:305 1.543
After features/support/hooks.rb:89 0.000
Feature: Localization
2:25.299
Before features/support/hooks.rb:259 0.008
Given I have started Tails from DVD without network and stopped at Tails Greeter's login screen 8.897
When I log in to a new session in Russian (ru) 33.362
Then the keyboard layout is set to "ru" 0.379
When the network is plugged 0.093
And Tor is ready 18.676
Then I successfully start the Unsafe Browser in "ru" 16.210
And I kill the Unsafe Browser 5.843
When I enable the screen keyboard 0.124
Then the screen keyboard works in Tor Browser 30.320
And DuckDuckGo is the default search engine 11.374
And I kill the Tor Browser 5.451
And the screen keyboard works in Thunderbird 13.992
And the layout of the screen keyboard is set to "ru" 0.572
After features/support/hooks.rb:305 1.068
After features/support/hooks.rb:89 0.000
Feature: Localization
2:22.880
Before features/support/hooks.rb:259 0.004
Given I have started Tails from DVD without network and stopped at Tails Greeter's login screen 8.469
When I log in to a new session in Spanish (es) 30.898
Then the keyboard layout is set to "es" 0.268
When the network is plugged 0.048
And Tor is ready 18.191
Then I successfully start the Unsafe Browser in "es" 17.156
And I kill the Unsafe Browser 5.854
When I enable the screen keyboard 0.125
Then the screen keyboard works in Tor Browser 31.189
And DuckDuckGo is the default search engine 11.813
And I kill the Tor Browser 5.549
And the screen keyboard works in Thunderbird 12.763
And the layout of the screen keyboard is set to "us" 0.553
After features/support/hooks.rb:305 2.058
After features/support/hooks.rb:89 0.000
Feature: Localization
2:19.403
Before features/support/hooks.rb:259 0.006
Given I have started Tails from DVD without network and stopped at Tails Greeter's login screen 7.978
When I log in to a new session in Turkish (tr) 31.243
Then the keyboard layout is set to "tr" 0.397
When the network is plugged 0.033
And Tor is ready 15.822
Then I successfully start the Unsafe Browser in "tr" 16.583
And I kill the Unsafe Browser 5.876
When I enable the screen keyboard 0.093
Then the screen keyboard works in Tor Browser 29.531
And DuckDuckGo is the default search engine 11.414
And I kill the Tor Browser 5.413
And the screen keyboard works in Thunderbird 14.449
And the layout of the screen keyboard is set to "us" 0.565
After features/support/hooks.rb:305 1.142
After features/support/hooks.rb:89 0.000
Tags: @product
45.144
Before features/support/hooks.rb:259 0.006
Given I have started Tails from DVD without network and stopped at Tails Greeter's login screen 8.196
And I capture all network traffic 0.006
When I disable MAC spoofing in Tails Greeter 3.655
And I log in to a new session 16.823
And the network is plugged 0.055
And Tor is ready 14.157
Then 1 network interface is enabled 0.174
And the 1st network device has its real MAC address configured 0.103
When I hotplug a network device and wait for it to be initialized 1.473
Then 2 network interfaces are enabled 0.081
And the 2nd network device has its real MAC address configured 0.081
And some network device leaked the real MAC address 0.333
After features/support/hooks.rb:305 0.863
After features/support/hooks.rb:89 0.057
Tags: @product
1:13.834
Before features/support/hooks.rb:259 0.015
Given I have started Tails from DVD without network and stopped at Tails Greeter's login screen 9.129
And I capture all network traffic 0.012
When I log in to a new session 17.519
And the network is plugged 0.222
And Tor is ready 44.587
Then 1 network interface is enabled 0.136
And the 1st network device has a spoofed MAC address configured 0.081
When I hotplug a network device and wait for it to be initialized 1.498
Then 2 network interfaces are enabled 0.089
And the 2nd network device has a spoofed MAC address configured 0.091
And no network device leaked the real MAC address 0.466
After features/support/hooks.rb:305 1.279
After features/support/hooks.rb:89 0.042
Tags: @product
33.811
Before features/support/hooks.rb:259 0.006
Given I have started Tails from DVD without network and stopped at Tails Greeter's login screen 9.906
And I capture all network traffic 0.009
And the network is plugged 0.046
And macchanger will fail by not spoofing and always returns false 0.209
When I log in to a new session 18.208
Then no network interfaces are enabled 0.405
And no network device leaked the real MAC address 0.017
And I see the "Network card eth0 disabled" notification after at most 60 seconds 5.007
After features/support/hooks.rb:305 0.786
After features/support/hooks.rb:89 0.040
Tags: @product
30.371
Before features/support/hooks.rb:259 0.007
Given I have started Tails from DVD without network and stopped at Tails Greeter's login screen 8.562
And I capture all network traffic 0.008
And the network is plugged 0.042
And macchanger will fail by not spoofing and always returns true 0.144
When I log in to a new session 16.253
Then no network interfaces are enabled 0.190
And no network device leaked the real MAC address 0.020
And I see the "Network card eth0 disabled" notification after at most 60 seconds 5.149
After features/support/hooks.rb:305 0.729
After features/support/hooks.rb:89 0.053
Tags: @product
1:55.851
Scenario MAC address spoofing fails and the module is not removed
Before features/support/hooks.rb:259 0.005
Steps
Given I have started Tails from DVD without network and stopped at Tails Greeter's login screen 8.170
And I capture all network traffic 0.021
And the network is plugged 0.277
And macchanger will fail by not spoofing and always returns true 0.155
And no network interface modules can be unloaded 0.440
When I log in to a new session 1:46.187
Then 1 network interface is enabled 0.356
But the MAC spoofing panic mode disabled networking 0.242
NetworkManager was not disabled.
<nil> is not true. (Test::Unit::AssertionFailedError)
./features/step_definitions/mac_spoofing.rb:94:in `/^the MAC spoofing panic mode disabled networking$/'
features/mac_spoofing.feature:63:in `But the MAC spoofing panic mode disabled networking'
And no network device leaked the real MAC address 0.000
And I see the "All networking disabled" notification after at most 60 seconds 0.000
After features/support/hooks.rb:305 4.306

SCENARIO FAILED: 'MAC address spoofing fails and the module is not removed' (at time 02:49:02)

Screenshot: https://jenkins.tails.boum.org/job/test_Tails_ISO_stable/4798/artifact/build-artifacts/02:49:02_MAC_address_spoofing_fails_and_the_module_is_not_removed.png

Video: https://jenkins.tails.boum.org/job/test_Tails_ISO_stable/4798/artifact/build-artifacts/02:49:02_MAC_address_spoofing_fails_and_the_module_is_not_removed.mkv

Boot log: https://jenkins.tails.boum.org/job/test_Tails_ISO_stable/4798/artifact/build-artifacts/02:49:02_MAC_address_spoofing_fails_and_the_module_is_not_removed.boot-log

Systemd journal: https://jenkins.tails.boum.org/job/test_Tails_ISO_stable/4798/artifact/build-artifacts/02:49:02_MAC_address_spoofing_fails_and_the_module_is_not_removed.journal

After features/support/hooks.rb:89 0.050
Tags: @product
59.090
Before features/support/hooks.rb:259 0.005
Given a computer 0.188
And I capture all network traffic 0.006
When I start the computer 0.967
Then the computer boots Tails 57.741
And no network interfaces are enabled 0.174
And no network device leaked the real MAC address 0.012
After features/support/hooks.rb:305 0.644
After features/support/hooks.rb:89 0.066
1:33.240
Before features/support/hooks.rb:259 0.008
Given a computer 0.216
And I start Tails from DVD with network unplugged and I login 1:19.209
And I plug and mount a USB drive containing a sample PNG 12.028
Then MAT can clean some sample PNG file 1.785
After features/support/hooks.rb:305 0.665
After features/support/hooks.rb:89 0.014
Feature: Networking
Tags: @product
1:26.368
Before features/support/hooks.rb:259 0.007
Given I have started Tails from DVD without network and logged in 8.979
And I wait between 30 and 60 seconds 57.055

Slept for 57 seconds

Then the Tor Status icon tells me that Tor is not usable 0.864
When the network is plugged 0.044
Then I successfully configure Tor 14.459
And the Tor Status icon tells me that Tor is usable 0.793
And all notifications have disappeared 4.118
And the time has synced 0.052
After features/support/hooks.rb:305 1.497
After features/support/hooks.rb:89 0.000
Feature: Networking
37.735
Before features/support/hooks.rb:259 0.008
Given I have started Tails from DVD without network and stopped at Tails Greeter's login screen 8.743
And I disable networking in Tails Greeter 1.020
And I log in to a new session 17.324
Then no network interfaces are enabled 0.269
When I hotplug a network device 0.152
And I wait 10 seconds 10.010

Slept for 10 seconds

Then no network interfaces are enabled 0.215
After features/support/hooks.rb:305 0.890
After features/support/hooks.rb:89 0.000
Feature: Onion Circuits
Tags: @product
24.664
Before features/support/hooks.rb:259 0.006
Given I have started Tails from DVD and logged in and the network is connected 12.500
When I start "Onion Circuits" via GNOME Activities Overview 10.008
Then Onion Circuits starts 1.911
And Onion Circuits shows some circuits 0.243
After features/support/hooks.rb:305 0.830
After features/support/hooks.rb:89 0.000
Tags: @product
2:22.920
Before features/support/hooks.rb:259 0.007
Given I have started Tails from DVD and logged in with an administration password and the network is connected 1:35.542
And I update APT using apt 18.632
And I install "python3-behave" using apt 25.810
Then the Tails Persistent Storage behave tests pass 2.934
After features/support/hooks.rb:305 0.737
After features/support/hooks.rb:89 0.000
Tags: @product
58.394
Before features/support/hooks.rb:259 0.007
Given I have started Tails without network from a USB drive with a persistent partition and stopped at Tails Greeter's login screen 12.176
When I log in to a new session without activating the Persistent Storage 20.400
Then Tails is running from USB drive "__internal" 0.984
And persistence is disabled 0.550
But a Tails persistence partition exists on USB drive "__internal" 24.281
After features/support/hooks.rb:305 0.843
After features/support/hooks.rb:89 0.000
Tags: @product
3:9.033
Before features/support/hooks.rb:259 0.007
Given I have started Tails without network from a USB drive without a persistent partition and logged in 12.695
Then Tails is running from USB drive "__internal" 2.112
When I create a file in the Persistent directory 0.397
And I create a persistent partition with the default settings 22.938
Then the file I created was copied to the Persistent Storage 0.504
When I shutdown Tails and wait for the computer to power off 11.348
And I start Tails from USB drive "__internal" with network unplugged and I login with persistence enabled 2:18.572
Then persistence for "Persistent" is active 0.397
And the file I created in the Persistent directory exists 0.066
After features/support/hooks.rb:305 0.967
After features/support/hooks.rb:89 0.011
Tags: @product
1:0.384
Before features/support/hooks.rb:259 0.007
Given I have started Tails without network from a USB drive without a persistent partition and logged in 10.896
And the system is very low on memory 3.150
When I create a file in the Persistent directory 1.109
When I try to create a persistent partition 24.762
Then The Persistent Storage app shows the error message "Not enough memory to create Persistent Storage" 0.287
When I close the Persistent Storage app 2.598
And I free up some memory 1.789
And I create a persistent partition with the default settings 15.542
Then the file I created was copied to the Persistent Storage 0.247
After features/support/hooks.rb:305 1.441
After features/support/hooks.rb:89 0.000
Tags: @product
2:52.743
Before features/support/hooks.rb:259 0.007
Given I have started Tails without network from a USB drive with a persistent partition enabled and logged in 11.245
Then Tails is running from USB drive "__internal" 0.508
And all tps features are active 2.362
And all persistent directories have safe access rights 2.745
When I disable the first tps feature 5.208
Then all tps features but the first one are active 2.246
And I shutdown Tails and wait for the computer to power off 8.334
And I start Tails from USB drive "__internal" with network unplugged and I login with persistence enabled 2:17.807
Then all tps features but the first one are active 2.284
After features/support/hooks.rb:305 0.987
After features/support/hooks.rb:89 0.013
Tags: @product
19.169
Before features/support/hooks.rb:259 0.009
Given I have started Tails without network from a USB drive with a persistent partition enabled and logged in 9.981
Then persistence for "Persistent" is active 0.170
And I create a file in the Persistent directory 0.094
Then the file I created was copied to the Persistent Storage 0.084
When I disable the first tps feature 5.488
Then persistence for "Persistent" is not active 0.068
And the Persistent directory does not exist 0.061
When I enable the first tps feature 3.076
Then persistence for "Persistent" is active 0.076
And the file I created in the Persistent directory exists 0.067
After features/support/hooks.rb:305 0.933
After features/support/hooks.rb:89 0.000
Tags: @product
18.720
Before features/support/hooks.rb:259 0.005
Given I have started Tails without network from a USB drive with a persistent partition enabled and logged in 9.510
Then persistence for "Persistent" is active 0.122
When I create a file in the Persistent directory 0.063
And I disable the first tps feature 5.244
And I delete the data of the Persistent Folder feature 3.726
Then the file I created does not exist on the Persistent Storage 0.053
After features/support/hooks.rb:305 0.926
After features/support/hooks.rb:89 0.000
Tags: @product
56.004
Before features/support/hooks.rb:259 0.009
Given I have started Tails without network from a USB drive with a persistent partition enabled and logged in 10.333
And the network is plugged 0.051
And Tor is ready 20.443
And I take note of which tps features are available 0.650
When I write some files expected to persist 1.605
And I shutdown Tails and wait for the computer to power off 6.920
# XXX: The next step succeeds (and the --debug output confirms that it's actually looking for the files) but will fail in a subsequent scenario restoring the same snapshot. This exactly what we want, but why does it work? What is guestfs's behaviour when qcow2 internal snapshots are involved?
Then only the expected files are present on the persistence partition on USB drive "__internal" 15.999
After features/support/hooks.rb:305 0.130
After features/support/hooks.rb:89 0.000
Tags: @product
3:3.467
Before features/support/hooks.rb:259 0.005
Given I have started Tails without network from a USB drive with a persistent partition enabled and logged in 10.348
And the network is plugged 0.037
And Tor is ready 18.736
And I add a wired DHCP NetworkManager connection called "persistent-con-current" 0.216
And I shutdown Tails and wait for the computer to power off 8.588
Given I start Tails from USB drive "__internal" with network unplugged and I login with persistence enabled 2:5.480
And I capture all network traffic 0.009
And the network is plugged 0.054
And Tor is ready 19.278
And I switch to the "persistent-con-current" NetworkManager connection 0.339
And the 1st network device has a spoofed MAC address configured 0.098
And no network device leaked the real MAC address 0.277
After features/support/hooks.rb:305 0.925
After features/support/hooks.rb:89 0.051
Tags: @product
1:2.224
Before features/support/hooks.rb:259 0.008
Given I have started Tails without network from a USB drive without a persistent partition and stopped at Tails Greeter's login screen 14.412
And I enable persistence creation in Tails Greeter 1.121
And I log in to a new session expecting no warning about the Persistent Storage not being activated 18.826
Then I create a persistent partition with the default settings using the wizard that was already open 27.864
After features/support/hooks.rb:305 2.114
After features/support/hooks.rb:89 0.000
Tags: @product
4:54.622
Before features/support/hooks.rb:259 0.008
Given I have started Tails without network from a USB drive with a persistent partition and stopped at Tails Greeter's login screen 13.713
When I enable persistence 36.152
Then no persistent Greeter options were restored 14.985
When I set all Greeter options to non-default values 23.772
And I log in to a new session in German (de) after having activated the Persistent Storage 49.181
Then all Greeter options are set to non-default values 0.441
When I cold reboot the computer 9.329
And the computer reboots Tails 1:0.750
Given I enable persistence 31.709
Then persistent Greeter options were restored 16.064
When I log in to a new session after having activated the Persistent Storage 38.080
Then all Greeter options are set to non-default values 0.442
After features/support/hooks.rb:305 1.348
After features/support/hooks.rb:89 0.009
Tags: @product
3:44.466
Before features/support/hooks.rb:259 0.005
Given I have started Tails without network from a USB drive with a persistent partition enabled and logged in 17.406
# Note that if anything fails after the passphrase was changed and
# before it's changed back below, subsequent scenarios might fail
# because the Persistent Storage doesn't have the expected passphrase.
When I change the passphrase of the Persistent Storage 29.401
And I shutdown Tails and wait for the computer to power off 14.872
Then I start Tails from USB drive "__internal" with network unplugged and I login with the changed persistence passphrase 2:4.348
And I change the passphrase of the Persistent Storage back to the original 38.437
After features/support/hooks.rb:305 2.691
After features/support/hooks.rb:89 0.051
Tags: @product
1:15.866
Before features/support/hooks.rb:259 0.048
Given I have started Tails without network from a USB drive with a persistent partition and stopped at Tails Greeter's login screen 28.360
And I log in to a new session without activating the Persistent Storage 19.019
Then persistence is disabled 0.619
But a Tails persistence partition exists on USB drive "__internal" 10.166
And all notifications have disappeared 11.448
When I delete the persistent partition 5.779
Then there is no persistence partition on USB drive "__internal" 0.470
After features/support/hooks.rb:305 0.747
After features/support/hooks.rb:89 0.000
Tags: @product
2:21.548
Before features/support/hooks.rb:259 0.005
Given I have started Tails without network from a USB drive with a persistent partition enabled and logged in 11.145
When I write some dotfile expected to persist 0.078
And I shutdown Tails and wait for the computer to power off 6.643
And I start Tails from USB drive "__internal" with network unplugged and I login with persistence enabled 2:3.313
Then the expected persistent dotfile is present in the filesystem 0.368
After features/support/hooks.rb:305 0.669
After features/support/hooks.rb:89 0.074
Tags: @product
1:39.418
Before features/support/hooks.rb:259 0.006
Given I have started Tails without network from a USB drive with a persistent partition and stopped at Tails Greeter's login screen 8.782
And I create a symlink "/home/amnesia/Persistent" to "/etc" 0.096
When I try to enable persistence 0.270
Then the Welcome Screen tells me that the Persistent Folder feature couldn't be activated 36.271
When I log in to a new session after having activated the Persistent Storage 36.726
And all notifications have disappeared 8.386
Then the Persistent Storage settings tell me that the Persistent Folder feature couldn't be activated 3.904
And all tps features are enabled 2.572
And all tps features but the first one are active 2.408
After features/support/hooks.rb:305 1.100
After features/support/hooks.rb:89 0.000
Tags: @product
5:15.570
Before features/support/hooks.rb:259 0.008
Given I have started Tails without network from a USB drive with a LUKS 1 persistent partition and stopped at Tails Greeter's login screen 3:57.317
And I enable persistence 33.283
And I log in to a new session after having activated the Persistent Storage 42.844
Then a Tails persistence partition with LUKS version 2 and argon2id exists on USB drive "__internal" 1.755
And persistence is enabled 0.369
After features/support/hooks.rb:305 1.494
After features/support/hooks.rb:89 0.000
Tags: @product
32.530
Before features/support/hooks.rb:259 0.009
Given I have started Tails without network from a USB drive with a LUKS 1 persistent partition and stopped at Tails Greeter's login screen 8.622
And I enable persistence but something goes wrong during the LUKS header upgrade 23.215
Then the Tails persistence partition on USB drive "__internal" still has LUKS version 1 0.692
After features/support/hooks.rb:305 0.647
After features/support/hooks.rb:89 0.000
Tags: @product
16.026
When I choose to connect to Tor automatically 2.011
And I accept Tor Connection's offer to use my persistent bridges 1.705
And I click "Connect to Tor" 1.205
Then I wait until Tor is ready 9.161
And tca.conf includes the configured bridges 0.011
And the "TorConfiguration" tps feature is enabled and active 1.074
And all Internet traffic has only flowed through the configured bridges or connectivity check service 0.856
After features/support/hooks.rb:305 0.724
After features/support/hooks.rb:89 0.051
Tags: @product
20.577
When I choose to connect to Tor automatically 2.412
And I accept Tor Connection's offer to use my persistent bridges 1.836
And I disable saving bridges to Persistent Storage 1.237
And I configure a direct connection in the Tor Connection Assistant 10.895
Then I wait until Tor is ready 2.200
And tca.conf includes no bridge 0.011
And the "TorConfiguration" tps feature is not enabled and not active 1.031
And all Internet traffic has only flowed through Tor or connectivity check service 0.952
After features/support/hooks.rb:305 0.666
After features/support/hooks.rb:89 0.075
Tags: @product
12.974
Before features/support/hooks.rb:259 0.008
Given I have started Tails from DVD without network and logged in 12.486
Then the live user has been setup by live-boot 0.138
And the live user is a member of only its own group and "cdrom dialout floppy video plugdev netdev scanner lp lpadmin users" 0.128
And the live user owns its home directory which has strict permissions 0.220
After features/support/hooks.rb:305 0.811
After features/support/hooks.rb:89 0.000
18.014
Before features/support/hooks.rb:259 0.008
Given I have started Tails from DVD and logged in and the network is connected 17.817
Then no unexpected services are listening for network connections 0.197

Service 'cups-browsed' is listening on 0.0.0.0:631 but has an exception

Service 'tor' is listening on 10.200.1.1:9050 but has an exception

Service 'onion-grater' is listening on 0.0.0.0:951 but has an exception

After features/support/hooks.rb:305 0.624
After features/support/hooks.rb:89 0.000
Tags: @product
18.768
Before features/support/hooks.rb:259 0.005
Given I have started Tails from DVD and logged in and the network is connected 12.708
Then the live user can only access allowed local services 6.060

amnesia could access cups-browsed on 0.0.0.0:631 (UDP) as expected

amnesia could access tor on 127.0.0.1:5353 (UDP) as expected

amnesia could not access tor on 127.0.0.1:9063 (TCP) as expected

amnesia could access tor on 127.0.0.1:9062 (TCP) as expected

amnesia could access tor on 127.0.0.1:9040 (TCP) as expected

amnesia could not access tor on 127.0.0.1:9052 (TCP) as expected

amnesia could access tor on 127.0.0.1:9050 (TCP) as expected

amnesia could access cupsd on 127.0.0.1:631 (TCP) as expected

amnesia could access tor on 10.200.1.1:9050 (TCP) as expected

amnesia could access onion-grater on 0.0.0.0:951 (TCP) as expected

After features/support/hooks.rb:305 0.690
After features/support/hooks.rb:89 0.000
Tags: @product
11.889
Before features/support/hooks.rb:259 0.011
Given I have started Tails from DVD without network and logged in 11.566
Then there are no unexpected messages of priority "err" or higher in the journal 0.323
After features/support/hooks.rb:305 0.863
After features/support/hooks.rb:89 0.000
Tags: @product
10.893
Before features/support/hooks.rb:259 0.006
Given I have started Tails without network from a USB drive with a persistent partition enabled and logged in 10.764
Then there are no unexpected messages of priority "err" or higher in the journal 0.128
After features/support/hooks.rb:305 1.136
After features/support/hooks.rb:89 0.000
Tags: @product
20.289
Before features/support/hooks.rb:259 0.007
Given I have started Tails from DVD and logged in and the network is connected 12.191
When I request a shutdown using the system menu 1.646
Then Tails eventually shuts down 6.451
After features/support/hooks.rb:305 0.146
After features/support/hooks.rb:89 0.000
1:18.512
Before features/support/hooks.rb:259 0.007
Given I have started Tails from DVD and logged in and the network is connected 12.090
When I request a reboot using the system menu 1.595
Then Tails eventually restarts 1:4.826
After features/support/hooks.rb:305 3.653
After features/support/hooks.rb:89 0.000
7.945
Given I monitor the network connections of SSH 0.062
And I have the SSH key pair for an SSH server 0.361
When I connect to an SSH server on the Internet 6.113
Then I have sucessfully logged into the SSH server 1.389
And I see that SSH is properly stream isolated 0.017
After features/support/hooks.rb:464 0.491
After features/support/hooks.rb:305 0.883
After features/support/hooks.rb:89 0.000
7.262
Given I have the SSH key pair for an SSH server 0.235
And an SSH server is running on the LAN 0.449
When I connect to an SSH server on the LAN 4.940
Then I am prompted to verify the SSH fingerprint for the SSH server 1.637
After features/support/hooks.rb:464 0.458
After features/support/hooks.rb:305 0.680
After features/support/hooks.rb:89 0.001
14.285
Given I have the SSH key pair for an SFTP server 0.211
When I connect to an SFTP server on the Internet 12.615
Then I successfully connect to the SFTP server 1.458
After features/support/hooks.rb:464 0.470
After features/support/hooks.rb:305 1.092
After features/support/hooks.rb:89 0.000
16.836
Given I cancel setting up an email account 3.169
When I open Thunderbird's Add-ons Manager 1.922
And I open the Extensions tab 1.087
Then I see that no add-ons are enabled in Thunderbird 10.655
After features/support/hooks.rb:464 0.788
After features/support/hooks.rb:305 1.210
After features/support/hooks.rb:89 0.000
45.938
When I enter my email credentials into the autoconfiguration wizard 12.324
Then the autoconfiguration wizard's choice for the incoming server is secure IMAP 0.315
And the autoconfiguration wizard's choice for the outgoing server is secure SMTP 0.343
When I accept the autoconfiguration wizard's configuration 18.578
And I send an email to myself 6.230
And I fetch my email 1.537
Then I can find the email I sent to myself in my inbox 6.608
After features/support/hooks.rb:464 1.372
After features/support/hooks.rb:305 1.182
After features/support/hooks.rb:89 0.000
9.730
When the network is plugged 0.055
And the Tor Connection Assistant autostarts 3.316
And I look at the hide mode but then I go back 4.969
And I choose to connect to Tor automatically 1.245
Then Tor Connection does not propose me to use Tor bridges 0.143
After features/support/hooks.rb:305 1.802
After features/support/hooks.rb:89 0.000
Tags: @product
1:36.434
Given the Tor network and default bridges are blocked 1.391
And the network is plugged 0.050
And I make sure time sync before Tor connects indicates a captive portal 1.236
And the Tor Connection Assistant autostarts 3.605
When I choose to connect to Tor automatically 1.757
And I click "Connect to Tor" 1.162
Then the Tor Connection Assistant fails to connect to Tor 28.666
And the Tor Connection Assistant knows that it's not the time sync that failed 10.554
And the Tor Connection Assistant knows that there might be a captive portal 0.117
When I open the Unsafe Browser from Tor Connection 17.494
And I log-in to the Captive Portal 18.241
And I close the Unsafe Browser 0.121
And the Tor network and default bridges are unblocked 2.248
And I allow time sync before Tor connects to work again 0.057
And I click "Connect to Tor" 1.158
Then I wait until Tor is ready 8.570
After features/support/hooks.rb:305 0.755
After features/support/hooks.rb:89 0.001
Tags: @product
12.342
Before features/support/hooks.rb:259 0.005
Given I have started Tails from DVD and logged in and the network is connected 11.816
Then the firewall's policy is to drop all IPv4 traffic 0.149
And the firewall is configured to only allow the clearnet and debian-tor users to connect directly to the Internet over IPv4 0.236
And the firewall's NAT rules only redirect traffic for the Unsafe Browser, Tor's TransPort, and DNSPort 0.075
And the firewall is configured to block all external IPv6 traffic 0.065
After features/support/hooks.rb:305 1.307
After features/support/hooks.rb:89 0.000
Tags: @product
43.455
Before features/support/hooks.rb:259 0.092
Given I have started Tails from DVD and logged in and the network is connected 12.578
And I capture all network traffic 0.009
When I successfully start the Unsafe Browser 17.527
And I open the Tails homepage in the Unsafe Browser 11.995
And the Tails homepage loads in the Unsafe Browser 0.602
Then the firewall leak detector has detected leaks 0.742
After features/support/hooks.rb:305 0.946
After features/support/hooks.rb:89 0.036
Tags: @product
13.590
Before features/support/hooks.rb:259 0.007
Given I have started Tails from DVD and logged in and the network is connected 12.465
And I capture all network traffic 0.006
And I disable Tails' firewall 0.220
When I do a TCP DNS lookup of "torproject.org" 0.789
Then the firewall leak detector has detected leaks 0.108
After features/support/hooks.rb:305 0.860
After features/support/hooks.rb:89 0.059
Tags: @product
12.882
Before features/support/hooks.rb:259 0.008
Given I have started Tails from DVD and logged in and the network is connected 11.848
And I capture all network traffic 0.010
And I disable Tails' firewall 0.264
When I do a UDP DNS lookup of "torproject.org" 0.673
Then the firewall leak detector has detected leaks 0.086
After features/support/hooks.rb:305 0.673
After features/support/hooks.rb:89 0.054
Tags: @product
17.333
Before features/support/hooks.rb:259 0.005
Given I have started Tails from DVD and logged in and the network is connected 12.875
And I capture all network traffic 0.005
And I disable Tails' firewall 0.250
When I send some ICMP pings 4.078
Then the firewall leak detector has detected leaks 0.123
After features/support/hooks.rb:305 0.709
After features/support/hooks.rb:89 0.042
13.472
Before features/support/hooks.rb:259 0.006
Before features/support/hooks.rb:456 0.009
Given I have started Tails from DVD and logged in and the network is connected 12.089
When I open an untorified TCP connection to 1.2.3.4 on port 42 1.317
Then the untorified connection fails 0.000
And the untorified connection is logged as dropped by the firewall 0.065
After features/support/hooks.rb:464 0.307
After features/support/hooks.rb:305 0.627
After features/support/hooks.rb:89 0.000
13.426
Before features/support/hooks.rb:259 0.008
Before features/support/hooks.rb:456 0.007
Given I have started Tails from DVD and logged in and the network is connected 11.996
When I open an untorified UDP connection to 1.2.3.4 on port 42 1.346
Then the untorified connection fails 0.000
And the untorified connection is logged as dropped by the firewall 0.083
After features/support/hooks.rb:464 0.323
After features/support/hooks.rb:305 0.660
After features/support/hooks.rb:89 0.000
17.367
Before features/support/hooks.rb:259 0.008
Before features/support/hooks.rb:456 0.008
Given I have started Tails from DVD and logged in and the network is connected 11.869
When I open an untorified ICMP connection to 1.2.3.4 5.381
Then the untorified connection fails 0.000
And the untorified connection is logged as dropped by the firewall 0.116
After features/support/hooks.rb:464 0.359
After features/support/hooks.rb:305 0.766
After features/support/hooks.rb:89 0.000
Tags: @product
25.796
Before features/support/hooks.rb:259 0.006
Given I have started Tails from DVD without network and logged in 9.741
And the system DNS is using the local DNS resolver 0.018
And the network is plugged 0.052
And I successfully configure Tor 15.973
Then the system DNS is still using the local DNS resolver 0.010
After features/support/hooks.rb:305 0.688
After features/support/hooks.rb:89 0.000
10.260
When I monitor the network connections of tails-security-check 0.088
And I re-run tails-security-check 0.135
Then I see that tails-security-check is properly stream isolated after 10 seconds 10.036
After features/support/hooks.rb:464 0.367
After features/support/hooks.rb:305 0.816
After features/support/hooks.rb:89 0.000
2.423
When I monitor the network connections of htpdate 0.077
And I re-run htpdate 2.325
Then I see that htpdate is properly stream isolated 0.020
After features/support/hooks.rb:464 0.414
After features/support/hooks.rb:305 0.662
After features/support/hooks.rb:89 0.000
32.174
When I monitor the network connections of tails-upgrade-frontend-wrapper 0.083
And I re-run tails-upgrade-frontend-wrapper 32.074
Then I see that tails-upgrade-frontend-wrapper is properly stream isolated 0.017
After features/support/hooks.rb:464 0.539
After features/support/hooks.rb:305 0.783
After features/support/hooks.rb:89 0.000
26.096
When I monitor the network connections of Tor Browser 0.101
And I start the Tor Browser 24.837
And the Tor Browser loads the startup page 1.109
Then I see that Tor Browser is properly stream isolated 0.046
After features/support/hooks.rb:464 1.145
After features/support/hooks.rb:305 0.925
After features/support/hooks.rb:89 0.000
Tags: @product
47.984
Before features/support/hooks.rb:259 0.006
Given I have started Tails from DVD and logged in and the network is connected 11.990
And a web server is running on the LAN 1.039
And I capture all network traffic 0.007
When I start the Tor Browser 21.947
And the Tor Browser loads the startup page 1.339
And I open a page on the LAN web server in the Tor Browser 10.084
Then the Tor Browser shows the "Unable to connect" error 1.053
And no traffic was sent to the web server on the LAN 0.522
After features/support/hooks.rb:305 0.954
After features/support/hooks.rb:89 0.059
55.265
Before features/support/hooks.rb:259 0.005
Before features/support/hooks.rb:456 0.006
Given I have started Tails from DVD and logged in and the network is connected 11.992
Then the amnesiac Tor Browser directory exists 0.070
And there is a GNOME bookmark for the amnesiac Tor Browser directory 1.760
And the persistent Tor Browser directory does not exist 0.054
When I start the Tor Browser 22.350
And the Tor Browser loads the startup page 1.188
Then I can save the current page as "index.html" to the default downloads directory 6.168
And I can print the current page as "output.pdf" to the default downloads directory 11.679
After features/support/hooks.rb:464 1.442
After features/support/hooks.rb:305 0.735
After features/support/hooks.rb:89 0.000
50.638
Before features/support/hooks.rb:259 0.006
Before features/support/hooks.rb:456 0.011
Given I have started Tails from DVD and logged in and the network is connected 11.962
When I start the Tor Browser 22.709
Then the Tor Browser loads the startup page 1.261
When I download some file in the Tor Browser 14.411
Then the file is saved to the default Tor Browser download directory 0.293
After features/support/hooks.rb:464 2.472
After features/support/hooks.rb:305 0.860
After features/support/hooks.rb:89 0.000
1:14.971
Before features/support/hooks.rb:259 0.007
Before features/support/hooks.rb:456 0.007
Given I have started Tails from DVD and logged in and the network is connected 12.438
When I start the Tor Browser 20.707
And the Tor Browser loads the startup page 1.190
Then I can listen to an Ogg audio track in Tor Browser 40.634
After features/support/hooks.rb:464 2.087
After features/support/hooks.rb:305 0.945
After features/support/hooks.rb:89 0.000
48.307
Before features/support/hooks.rb:259 0.008
Before features/support/hooks.rb:456 0.005
Given I have started Tails from DVD and logged in and the network is connected 12.236
When I start the Tor Browser 21.293
And the Tor Browser loads the startup page 1.060
Then I can watch a WebM video in Tor Browser 13.718
After features/support/hooks.rb:464 1.536
After features/support/hooks.rb:305 1.011
After features/support/hooks.rb:89 0.000
Tags: @product
1:16.588
Before features/support/hooks.rb:259 0.006
Given I have started Tails from DVD and logged in and the network is connected 11.843
And I copy "/usr/share/synaptic/html/index.html" to "/home/amnesia/Tor Browser/synaptic.html" as user "amnesia" 0.124
And I copy "/usr/share/synaptic/html/index.html" to "/home/amnesia/.gnupg/synaptic.html" as user "amnesia" 0.061
And I copy "/usr/share/synaptic/html/index.html" to "/tmp/synaptic.html" as user "amnesia" 0.096
Then the file "/home/amnesia/.gnupg/synaptic.html" exists 0.044
And the file "/lib/live/mount/overlay/rw/home/amnesia/.gnupg/synaptic.html" exists 0.046
And the file "/live/overlay/rw/home/amnesia/.gnupg/synaptic.html" exists 0.048
And the file "/tmp/synaptic.html" exists 0.064
Given I start monitoring the AppArmor log of "torbrowser_firefox" 0.155
When I start the Tor Browser 25.266
And the Tor Browser loads the startup page 1.174
And I open the address "file:///home/amnesia/Tor Browser/synaptic.html" in the Tor Browser 10.617
Then I see "TorBrowserSynapticManual.png" after at most 5 seconds 0.575
And AppArmor has not denied "torbrowser_firefox" from opening "/home/amnesia/Tor Browser/synaptic.html" 0.319
Given I restart monitoring the AppArmor log of "torbrowser_firefox" 0.169
When I open the address "file:///home/amnesia/.gnupg/synaptic.html" in the Tor Browser 6.354
Then I do not see "TorBrowserSynapticManual.png" after at most 5 seconds 0.534
And AppArmor has denied "torbrowser_firefox" from opening "/home/amnesia/.gnupg/synaptic.html" 0.093
Given I restart monitoring the AppArmor log of "torbrowser_firefox" 0.124
When I open the address "file:///lib/live/mount/overlay/rw/home/amnesia/.gnupg/synaptic.html" in the Tor Browser 6.124
Then I do not see "TorBrowserSynapticManual.png" after at most 5 seconds 0.513
And AppArmor has denied "torbrowser_firefox" from opening "/usr/lib/live/mount/overlay/rw/home/amnesia/.gnupg/synaptic.html" 0.067
Given I restart monitoring the AppArmor log of "torbrowser_firefox" 0.134
When I open the address "file:///live/overlay/rw/home/amnesia/.gnupg/synaptic.html" in the Tor Browser 5.396
Then I do not see "TorBrowserSynapticManual.png" after at most 5 seconds 0.525
# Due to our AppArmor aliases, /live/overlay will be treated
# as /lib/live/mount/overlay.
And AppArmor has denied "torbrowser_firefox" from opening "/usr/lib/live/mount/overlay/rw/home/amnesia/.gnupg/synaptic.html" 0.060
# We do not get any AppArmor log for when access to files in /tmp is denied
# since we explictly override (commit 51c0060) the rules (from the user-tmp
# abstraction) that would otherwise allow it, and we do so with "deny", which
# also specifies "noaudit". We could explicitly specify "audit deny" and
# then have logs, but it could be a problem when we set up desktop
# notifications for AppArmor denials (#9337).
When I open the address "file:///tmp/synaptic.html" in the Tor Browser 5.528
Then I do not see "TorBrowserSynapticManual.png" after at most 5 seconds 0.519
After features/support/hooks.rb:305 0.619
After features/support/hooks.rb:89 0.000
Tags: @product
37.948
Before features/support/hooks.rb:259 0.006
Given I have started Tails from DVD and logged in and the network is connected 11.897
When I start the Tor Browser 24.849
Then the Tor Browser uses all expected TBB shared libraries 1.200
After features/support/hooks.rb:305 0.735
After features/support/hooks.rb:89 0.000
53.936
Before features/support/hooks.rb:259 0.005
Before features/support/hooks.rb:456 0.007
Given I have started Tails from DVD and logged in and the network is connected 12.056
When I start the Tor Browser 23.136
And the Tor Browser loads the startup page 1.164
And I open the Tails homepage in the Tor Browser 11.119
Then the Tor Browser loads the Tails homepage 1.319
When I request a new identity in Tor Browser 3.331
Then the Tor Browser restarts into a fresh session 1.809
After features/support/hooks.rb:464 1.982
After features/support/hooks.rb:305 1.067
After features/support/hooks.rb:89 0.000
Tags: @product
37.237
Before features/support/hooks.rb:259 0.005
Given I have started Tails from DVD and logged in and the network is connected 12.234
When I start the Tor Browser 22.219
And the Tor Browser loads the startup page 1.299
Then Tor Browser's circuit view is working 1.483
After features/support/hooks.rb:305 0.713
After features/support/hooks.rb:89 0.000
Tags: @product
56.267
Before features/support/hooks.rb:259 0.011
Given I have started Tails from DVD and logged in and the network is connected 12.131
When I start the Tor Browser 21.359
And the Tor Browser loads the startup page 1.133
When I open the address "https://net.ipcalf.com/" in the Tor Browser 10.289
Then Tor Browser displays a 'ifconfig | grep inet | grep -v inet6 | cut -d" " -f2 | tail -n1' heading on the "Network IP Address via ipcalf.com" page 1.132
When I open the address "https://mozilla.github.io/webrtc-landing/pc_test.html" in the Tor Browser 9.053
Then Tor Browser displays a "RTCPeerConnection is missing!" heading on the "Simple RTCPeerConnection Video Test" page 1.167
After features/support/hooks.rb:305 0.709
After features/support/hooks.rb:89 0.000
Tags: @product
1:44.944
Before features/support/hooks.rb:259 0.006
Given I have started Tails without network from a USB drive with a persistent partition enabled and logged in 10.538
And the network is plugged 0.042
And I successfully configure Tor 22.748
And available upgrades have been checked 1.102
And all notifications have disappeared 4.019
Then the persistent Tor Browser directory exists 0.060
And there is a GNOME bookmark for the persistent Tor Browser directory 1.501
When I start the Tor Browser 22.418
And I open the address "https://tails.net/about" in the Tor Browser 10.592
And "Tails - How Tails works" has loaded in the Tor Browser 1.359
Then I can save the current page as "index.html" to the persistent Tor Browser directory 8.895
And I open the address "file:///home/amnesia/Persistent/Tor Browser/index.html" in the Tor Browser 9.194
Then "Tails - How Tails works" has loaded in the Tor Browser 1.704
And I can print the current page as "output.pdf" to the persistent Tor Browser directory 10.766
After features/support/hooks.rb:305 0.812
After features/support/hooks.rb:89 0.000
Tags: @product
42.618
Before features/support/hooks.rb:259 0.006
Given I have started Tails from DVD without network and logged in 8.506
Then the amnesiac Documents directory exists 0.045
And there is a GNOME bookmark for the amnesiac Documents directory 1.605
Then I start the Tor Browser in offline mode 24.114
And I can save the current page as "index.html" to the Documents GNOME bookmark 8.346
After features/support/hooks.rb:305 0.793
After features/support/hooks.rb:89 0.000
Tags: @product
42.429
Before features/support/hooks.rb:259 0.006
Given I have started Tails from DVD without network and logged in 8.378
Then the amnesiac Downloads directory exists 0.063
And there is a GNOME bookmark for the amnesiac Downloads directory 1.566
Then I start the Tor Browser in offline mode 23.447
And I can save the current page as "index.html" to the Downloads GNOME bookmark 8.974
After features/support/hooks.rb:305 0.738
After features/support/hooks.rb:89 0.000
Tags: @product
1:1.694
Scenario Outline The default XDG directories are usable in Tor Browser
Before features/support/hooks.rb:259 0.005
Steps
Given I have started Tails from DVD without network and logged in 8.186
Then the amnesiac Music directory exists 0.067
And there is a GNOME bookmark for the amnesiac Music directory 1.534
Then I start the Tor Browser in offline mode 23.793
And I can save the current page as "index.html" to the Music GNOME bookmark 28.113
The
The page was not saved to /home/amnesia/Music/index.html (Timeout::Error)
./features/support/helpers/misc_helpers.rb:146:in `rescue in try_for'
./features/support/helpers/misc_helpers.rb:52:in `try_for'
./features/step_definitions/browser.rb:582:in `/^I (can|cannot) save the current page as "([^"]+[.]html)" to the (.*) (directory|GNOME bookmark)$/'
features/torified_browsing.feature:144:in `And I can save the current page as "index.html" to the Music GNOME bookmark'
features/torified_browsing.feature:139:in `And I can save the current page as "index.html" to the <dir> GNOME bookmark'
After features/support/hooks.rb:305 4.240

SCENARIO FAILED: 'The default XDG directories are usable in Tor Browser, Examples (#3)' (at time 04:04:33)

Screenshot: https://jenkins.tails.boum.org/job/test_Tails_ISO_stable/4798/artifact/build-artifacts/04:04:33_The_default_XDG_directories_are_usable_in_Tor_Browser,_Examples___3_.png

Video: https://jenkins.tails.boum.org/job/test_Tails_ISO_stable/4798/artifact/build-artifacts/04:04:33_The_default_XDG_directories_are_usable_in_Tor_Browser,_Examples___3_.mkv

Boot log: https://jenkins.tails.boum.org/job/test_Tails_ISO_stable/4798/artifact/build-artifacts/04:04:33_The_default_XDG_directories_are_usable_in_Tor_Browser,_Examples___3_.boot-log

Systemd journal: https://jenkins.tails.boum.org/job/test_Tails_ISO_stable/4798/artifact/build-artifacts/04:04:33_The_default_XDG_directories_are_usable_in_Tor_Browser,_Examples___3_.journal

After features/support/hooks.rb:89 0.000
Tags: @product
42.665
Before features/support/hooks.rb:259 0.007
Given I have started Tails from DVD without network and logged in 9.230
Then the amnesiac Pictures directory exists 0.058
And there is a GNOME bookmark for the amnesiac Pictures directory 1.406
Then I start the Tor Browser in offline mode 23.465
And I can save the current page as "index.html" to the Pictures GNOME bookmark 8.505
After features/support/hooks.rb:305 0.874
After features/support/hooks.rb:89 0.000
Tags: @product
43.153
Before features/support/hooks.rb:259 0.006
Given I have started Tails from DVD without network and logged in 8.240
Then the amnesiac Videos directory exists 0.052
And there is a GNOME bookmark for the amnesiac Videos directory 1.483
Then I start the Tor Browser in offline mode 23.928
And I can save the current page as "index.html" to the Videos GNOME bookmark 9.448
After features/support/hooks.rb:305 0.679
After features/support/hooks.rb:89 0.000
Tags: @product
3:30.267
Before features/support/hooks.rb:259 0.007
Given I have started Tails without network from a USB drive with a persistent partition enabled and logged in 9.209
And all tps features are active 2.269
And all persistent filesystems have safe access rights 0.205
And all persistence configuration files have safe access rights 0.435
And all persistent directories have safe access rights 2.540
When I start the Tor Browser in offline mode 21.746
And I add a bookmark to eff.org in the Tor Browser 13.413
And I cold reboot the computer 11.472
And the computer reboots Tails 1:0.100
And I enable persistence 16.697
And I log in to a new session 39.115
And all notifications have disappeared 8.920
And I start the Tor Browser in offline mode 22.830
Then the Tor Browser has a bookmark to eff.org 1.309
After features/support/hooks.rb:305 0.961
After features/support/hooks.rb:89 0.009
5.800
When I clone the Git repository "https://github.com/intrigeri/Dist-Zilla-Plugin-LocaleMsgfmt.git" in GNOME Terminal 5.589
Then the Git repository "Dist-Zilla-Plugin-LocaleMsgfmt" has been cloned successfully 0.211
After features/support/hooks.rb:464 0.488
After features/support/hooks.rb:305 0.696
After features/support/hooks.rb:89 0.000
8.644
Given I have the SSH key pair for a Git repository 0.240
When I clone the Git repository "ssh://gitolite3@lizard.tails.boum.org:3004/myprivatekeyispublic/testing.git" in GNOME Terminal 8.224
Then the Git repository "testing" has been cloned successfully 0.179
After features/support/hooks.rb:464 0.431
After features/support/hooks.rb:305 0.635
After features/support/hooks.rb:89 0.000
0.435
When I wget "https://example.com/" to stdout 0.435
Then the wget command is successful 0.000
And the wget standard output contains "Example Domain" 0.000
After features/support/hooks.rb:464 0.346
After features/support/hooks.rb:305 0.627
After features/support/hooks.rb:89 0.000
4.887
When I wget "some Tails mirror" to stdout with the '--spider --header="Host: dl.amnesia.boum.org"' options 4.887

Resolved dl.amnesia.boum.org to 139.178.88.99

Resolved dl.amnesia.boum.org to 208.80.154.139

Then the wget command is successful 0.000
After features/support/hooks.rb:464 0.717
After features/support/hooks.rb:305 0.584
After features/support/hooks.rb:89 0.000
0.476
When I curl "https://example.com/" to stdout 0.476
Then the curl command is successful 0.000
And the curl standard output contains "Example Domain" 0.000
After features/support/hooks.rb:464 0.312
After features/support/hooks.rb:305 0.795
After features/support/hooks.rb:89 0.000
Feature: Using Totem
Tags: @product
45.399
Given I have started Tails from DVD without network and logged in 8.263
And I plug and mount a USB drive containing sample videos 12.178
And I copy the sample videos to "/home/amnesia" as user "amnesia" 0.114
And the file "/home/amnesia/video.mp4" exists 0.059
Given I start monitoring the AppArmor log of "/usr/bin/totem" 0.182
When I open "/home/amnesia/video.mp4" with Totem 3.251
Then I see "SampleLocalMp4VideoFrame.png" after at most 40 seconds 5.999
And AppArmor has not denied "/usr/bin/totem" from opening "/home/amnesia/video.mp4" 0.479
Given I close Totem 0.206
And I copy the sample videos to "/home/amnesia/.gnupg" as user "amnesia" 0.087
And the file "/home/amnesia/.gnupg/video.mp4" exists 0.060
And I restart monitoring the AppArmor log of "/usr/bin/totem" 0.100
When I try to open "/home/amnesia/.gnupg/video.mp4" with Totem 2.190
Then Totem tells me it is not allowed to open this file 1.757
And AppArmor has denied "/usr/bin/totem" from opening "/home/amnesia/.gnupg/video.mp4" 0.067
Given I close Totem 0.140
And the file "/lib/live/mount/overlay/rw/home/amnesia/.gnupg/video.mp4" exists 0.051
And I restart monitoring the AppArmor log of "/usr/bin/totem" 0.117
When I try to open "/lib/live/mount/overlay/rw/home/amnesia/.gnupg/video.mp4" with Totem 2.225
Then Totem tells me it is not allowed to open this file 0.872
And AppArmor has denied "/usr/bin/totem" from opening "/usr/lib/live/mount/overlay/rw/home/amnesia/.gnupg/video.mp4" 0.072
Given I close Totem 0.154
And the file "/live/overlay/rw/home/amnesia/.gnupg/video.mp4" exists 0.064
And I restart monitoring the AppArmor log of "/usr/bin/totem" 0.134
When I try to open "/live/overlay/rw/home/amnesia/.gnupg/video.mp4" with Totem 2.160
Then Totem tells me it is not allowed to open this file 0.806
# Due to our AppArmor aliases, /live/overlay will be treated
# as /usr/lib/live/mount/overlay.
And AppArmor has denied "/usr/bin/totem" from opening "/usr/lib/live/mount/overlay/rw/home/amnesia/.gnupg/video.mp4" 0.078
Given I close Totem 0.141
And I copy "/home/amnesia/video.mp4" to "/home/amnesia/.purple/otr.private_key" as user "amnesia" 0.064
And the file "/home/amnesia/.purple/otr.private_key" exists 0.057
And I restart monitoring the AppArmor log of "/usr/bin/totem" 0.117
When I try to open "/home/amnesia/.purple/otr.private_key" with Totem 2.188
Then Totem tells me it is not allowed to open this file 0.877
And AppArmor has denied "/usr/bin/totem" from opening "/home/amnesia/.purple/otr.private_key" 0.075
After features/support/hooks.rb:305 0.717
After features/support/hooks.rb:89 0.000
Feature: Using Totem
25.038
Given I have started Tails from DVD and logged in and the network is connected 12.019
Then I can watch a WebM video over HTTPs 13.019
After features/support/hooks.rb:464 0.587
After features/support/hooks.rb:305 0.859
After features/support/hooks.rb:89 0.000
Feature: Using Totem
Tags: @product
36.649
Given I have started Tails without network from a USB drive with a persistent partition enabled and logged in 9.923
And I plug and mount a USB drive containing sample videos 10.762
And I copy the sample videos to "/home/amnesia/Persistent" as user "amnesia" 0.105
When I open "/home/amnesia/Persistent/video.mp4" with Totem 3.487
Then I see "SampleLocalMp4VideoFrame.png" after at most 40 seconds 7.552
Given I close Totem 0.511
And I start monitoring the AppArmor log of "/usr/bin/totem" 0.184
And I copy the sample videos to "/home/amnesia/.gnupg" as user "amnesia" 0.072
When I try to open "/home/amnesia/.gnupg/video.mp4" with Totem 2.189
Then Totem tells me it is not allowed to open this file 1.739
And AppArmor has denied "/usr/bin/totem" from opening "/home/amnesia/.gnupg/video.mp4" 0.120
After features/support/hooks.rb:305 0.860
After features/support/hooks.rb:89 0.000
Tags: @product
47.322
Before features/support/hooks.rb:259 0.007
Given I have started Tails from DVD without network and stopped at Tails Greeter's login screen 10.271
And I disable the Unsafe Browser 3.895
And I log in to a new session 21.891
And the network is plugged 0.046
And all notifications have disappeared 7.161
When I try to start the Unsafe Browser 0.201
Then the Unsafe Browser complains that it is disabled 3.854
After features/support/hooks.rb:305 1.033
After features/support/hooks.rb:89 0.000
Tags: @product
43.874
Before features/support/hooks.rb:259 0.007
Given I have started Tails from DVD and logged in and the network is connected 12.638
And a web server is running on the LAN 1.046
When I successfully start the Unsafe Browser 18.440
And I open a page on the LAN web server in the Unsafe Browser 11.595
Then the Unsafe Browser displays the LAN web server hello message 0.153
After features/support/hooks.rb:305 0.880
After features/support/hooks.rb:89 0.001
Tags: @product @doc
48.905
Before features/support/hooks.rb:259 0.008
Given I have started Tails from DVD and logged in and the network is connected 12.554
When I successfully start the Unsafe Browser 17.461
Then the Unsafe Browser runs as the expected user 0.664
And the Unsafe Browser has a red theme 0.571
And the Unsafe Browser shows a warning as its start page 0.581
And the Unsafe Browser has no add-ons enabled 8.576
And the Unsafe Browser has no bookmarks 7.516
And the Unsafe Browser uses all expected TBB shared libraries 0.979
After features/support/hooks.rb:305 0.654
After features/support/hooks.rb:89 0.000
Tags: @product
41.596
Before features/support/hooks.rb:259 0.008
Given I have started Tails from DVD and logged in and the network is connected 11.879
When I successfully start the Unsafe Browser 17.322
When I open the Tails homepage in the Unsafe Browser 11.571
Then the Tails homepage loads in the Unsafe Browser 0.573
And the Unsafe Browser has sent packets out to the Internet 0.249
After features/support/hooks.rb:305 0.685
After features/support/hooks.rb:89 0.000
32.596
Before features/support/hooks.rb:259 0.006
Given I have started Tails from DVD and logged in and the network is connected 11.746
When I successfully start the Unsafe Browser 18.684
And I close the Unsafe Browser 0.122
Then I see the "Shutting down the Unsafe Browser..." notification after at most 60 seconds 1.530
And the Unsafe Browser chroot is torn down 0.512
After features/support/hooks.rb:305 0.739
After features/support/hooks.rb:89 0.000
43.370
Before features/support/hooks.rb:259 0.006
Given I have started Tails from DVD and logged in and the network is connected 12.266
When I successfully start the Unsafe Browser 17.171
# Wait for whatever facility the GNOME Activities Overview uses to
# learn about which applications are running to "settle". Without
# this sleep, it is confused and it's impossible to start a new
# instance (it will just switch to the one we already started).
And I wait 10 seconds 10.010

Slept for 10 seconds

And I try to start the Unsafe Browser 0.186
Then I see a warning about another instance already running 3.734
After features/support/hooks.rb:305 1.013
After features/support/hooks.rb:89 0.000
Tags: @product
42.269
Before features/support/hooks.rb:259 0.008
Given I have started Tails from DVD and logged in and the network is connected 12.519
When I configure the Unsafe Browser to use a local proxy 0.179
And I successfully start the Unsafe Browser 17.543
And I open the Tails homepage in the Unsafe Browser 11.529
Then I see "BrowserProxyRefused.png" after at most 60 seconds 0.497
After features/support/hooks.rb:305 1.331
After features/support/hooks.rb:89 0.000
2:29.202
Before features/support/hooks.rb:259 0.005
Before features/support/hooks.rb:456 0.006
Given I have started Tails from DVD and logged in and the network is connected 11.744